{"text_format":"1","workbook":"xlsx","n_sheets":9,"sheets":["HDSD","Define","5.Dashboard","DB_Data","4.Report","3.TTNV","2. QT_LV","1. QT_ĐV","DSNV_Import"],"not_rendered":{"charts":10,"images":0,"macros":1,"external_links":0,"defined_names":14,"comments":2,"pivot_tables":0},"unopened":[],"bounds":{"document_bytes":16777216,"sheet_cells":100000,"rows_first":2000,"rows_last":500,"rows_between":2000,"halvings":0,"cell_chars":16384,"cell_head_chars":4096},"cells_cut":0,"cells_raw":0,"read":"whole","date_system":"1900"}

{"sheet":"HDSD","index":0,"n_rows":76,"n_cols":17,"rows_kept":76,"cut":false,"hidden":false,"merged":[[1,16,1,18],[2,16,15,18],[13,2,13,13],[16,2,16,13],[1,1,1,14],[3,2,3,13],[5,2,5,13],[12,2,12,13],[11,2,11,13],[8,1,8,14],[10,2,10,13],[14,2,14,13],[39,1,39,14],[71,1,71,14],[17,1,17,14],[30,1,30,14],[19,2,19,13],[20,2,20,13],[21,2,21,13],[27,2,27,13],[22,2,22,13],[23,2,23,13],[24,2,24,13],[25,2,25,13],[26,2,26,13]]}
[]
[null,"...UPCOMING VERSION 8",null,null,null,null,null,null,null,null,null,null,null,null,null,null,"LƯU Ý"]
[null,null,null,null,null,null,null,null,null,null,null,null,null,null,null,null,"File có sử dụng công thức mảng. Để sử dụng tốt nhất với file này. Hãy:\n\n1. Chuyển từ chế độ tính toán tự động sang chế độ tính toán bằng tay (khi nào ấn F9 bảng Excel mới tính toán lại)\nHướng dẫn: Tab Formulas\\Calculation Options\\Manual\n\n2. Tuân thủ các nguyên tắc nhập liệu, sai 1 ly, sẽ không ra kết quả. Vì vậy, cần phải có kỹ năng Excel tốt"]
[null,null,"- Bổ sung Nút \"Thêm mới đơn vị\" và \"Thêm mới quá trình\" dùng VBA"]
[null,null,"- Bổ sung tính năng xem thông tin nhân viên bằng VBA"]
[]
[]
[]
[null,"UPDATE VERSION 7"]
[]
[null,null,"- Trong sheet \"3.TTNS\", Bổ sung thêm Nút \"Thêm mới nhân viên\" sử dụng VBA để thêm các thông tin cố định về nhân viên"]
[null,null,"   Theo đó, Thông tin nhân viên mới sẽ được import theo 2 cách: Import bằng Form VBA HOẶC điền luôn vào sheet \"DSNS_import theo các trường"]
[null,null,"- Chỉnh sửa lại giao diện của các Sheet cho rõ ràng hơn"]
[null,null,"- Tối ưu hóa công thức nhằm giải tài nguyên CPU khi chạy hàm và tăng tốc độ xử lý dữ liệu"]
[null,null,"- Sửa lỗi và các tùy chỉnh nhỏ khác"]
[]
[]
[null,"UPDATE VERSION 6"]
[]
[null,null,"- Sửa lại 1 số công thức trong Report để phân tách đúng Số lượng nhân sự ngày đầu kỳ và Số lượng nhân sự tăng do thay đổi đơn vị"]
[null,null,"+ Cộng thêm người nghỉ vào ngày đầu tháng vào đây. Do người nghỉ vào ngày đầu tháng ko thể đưa vào Danh sách nghỉ của tháng trước"]
[null,null,"+ Không tính nhân sự tăng mới (vẫn tính tăng từ thai sản) vào ngày đầu kỳ vào cột \"Số lượng nhân sự ngày đầu kỳ"]
[null,null,"- Sửa lại công thức ngày vào công ty tại sheet \"3.TTNV\" với điều kiện lấy theo ngày \"tăng mới\" gần đây nhất"]
[null,null,"- Trong sheet \"2. QT_LV\":"]
[null,null,"+ Thêm cột phụ \"Có phải quá trình này là QT tăng mới nhân sự vào ngày đầu tháng hay không\" để phân biệt với QT thai sản đi làm trở lại"]
[null,null,"+ Thêm cột phụ \"Có phải QT này kết thúc thì QT tiếp theo sang 1 ĐV hoặc CD mới TRONG THÁNG ko?\" để xác định nhân viên \nkết thúc quá trình này có phải do chuyển sang chức danh hoặc đơn vị mới hay không"]
[null,null,"+ Thêm cột kiểm tra \"Check - Có nhập đúng đơn vị trước khi nghỉ việc không\" để xác định xem có nhập nhầm đơn vị cuối cùng\ntrước khi nghỉ việc hay không"]
[null,null,"+ Thêm cột kiểm tra \"Check - Có nhập đúng đơn vị khi vào công ty hay không\" để xác định xem có nhập nhầm đơn vị đầu tiên\nkhi vào công ty hay không"]
[]
[]
[null,"UPDATE VER 5"]
[]
[null,null,"- Theo dõi toàn bộ thông tin về nhân viên trong 1 file duy nhất"]
[null,null,"- Tự động cập nhật trạng thái làm việc của nhân viên tới thời điểm tùy chọn (ngày đầu kỳ, ngày cuối kỳ, ngày hiện tại, tháng) => giúp việc tra cứu thông tin"]
[null,null,"- Tự động cập nhật trạng thái của đơn vị tới thời điểm tùy chọn (ngày đầu kỳ, ngày cuối kỳ, ngày hiện tại, tháng) => giúp việc tra cứu thông tin"]
[null,null,"- Xem Dashboard để biết thông tin tăng giảm số lượng nhân sự theo phòng ban, tại từng thời điểm tùy chọn"]
[null,null,"- Xem Báo cáo tỷ lệ nghỉ việc theo giai đoạn."]
[]
[]
[null,"HƯỚNG DẪN SỬ DỤNG ĐỐI VỚI NGƯỜI LÀM DỮ LIỆU"]
[]
[null,null,"Bước 1:","Thêm mới quá trình đơn vị tại sheet \"1.QT_ĐV\""]
[null,null,null,"- Quá trình đơn vị cho biết: danh sách những đơn vị đang hoạt động tại 1 thời điểm được chọn"]
[null,null,null,"- Khi nào cần làm sheet \"1.QT_ĐV\": khi có sự thay đổi 1 trong các thành phần \"Công ty\", \"Phòng\", \"Nhóm\""]
[null,null,null,"- Quá trình đơn vị có thể nối tiếp nhau, hoặc cách rời nhau về thời gian, nhưng tuyệt đối cùng 1 đơn vị thì không giao thoa với nhau về quá trình"]
[null,null,null,null,"VD:","Phòng Tổ chức Hành chính",null,null,"Từ","2020-01-01","Đến","2020-05-31"]
[null,null,null,null,null,"Phòng Hành chính Nhân sự",null,null,"Từ","2020-06-01","Đến","2100-12-31"]
[null,null,null,"- Khi kết thúc 1 Quá trình đơn vị, cần phải nhập ngày kết thúc và lý do kết thúc"]
[]
[]
[null,null,"Bước 2:","Thêm mới thông tin nhân viên tại sheet \"3.TTNV\", nút \"Thêm mới nhân viên\""]
[null,null,null,"- Sheet \"3.TTNV\" bao gồm 2 nhóm dữ liệu:"]
[null,null,null,null,"+ Cố định: Là những thông tin được \"Điền\", có tính chất cố định trong 1 khoảng thời gian nhất định"]
[null,null,null,null,"+ Thay đổi theo thời gian: Là những thông tin có \"CT\", chủ yếu liên quan đến sự thay đổi về đơn vị, chức danh, ngày vào, nghỉ việc"]
[null,null,null,"- Các thông tin nhân viên khi tuyển dụng mới thường là những thông tin \"cố định\". Nhập các thông tin này vào. Khi có thay đổi thì upgrade lại"]
[null,null,null,"- Các thông tin nhân viên thay đổi theo thời gian nhập tại bước 3"]
[null,null,null,"- Sử dụng 3 cột check để check sai sót về nhập liệu và sửa lại"]
[null,null,null,null,"+ \"Check - \"Từ ngày\" có nằm sau \"đến ngày\" không\" để xác định xem có nhập ngày kết thúc quá trình trước ngày bắt đầu quá trình không"]
[null,null,null,null,"+ \"Check - QT có liền mạch không, có bị trùng nhau không\" để xác định xem các quá trình có liền mạch với nhau hoặc giao nhau không"]
[null,null,null,null,"+ \"Check - Có nhập đúng đơn vị trước khi nghỉ việc không\" để xác định xem có nhập nhầm đơn vị cuối cùng trước khi nghỉ việc hay không"]
[null,null,null,null,"+ \"Check - Có nhập đúng đơn vị khi vào công ty hay không\" để xác định xem có nhập nhầm đơn vị đầu tiên khi vào công ty hay không"]
[]
[]
[null,null,"Bước 3:","Thêm mới quá trình làm việc tại sheet \"2.QT_LV\""]
[null,null,null,"- Quá trình làm việc cho biết: 1 cá nhân đang có chức danh gì, đang ở tại đơn vị nào, trạng thái làm việc như thế nào tại 1 thời điểm được chọn"]
[null,null,null,"- Việc lựa chọn lý do tăng/giảm quá trình có ảnh hưởng rất lớn đến dashboard, báo cáo. Lưu ý:"]
[null,null,null,null,"+ Trả lời câu hỏi \"việc XUẤT HIỆN thêm quá trình có ảnh hưởng thế nào đến bộ phận hiện tại?\""]
[null,null,null,null,"+ Giảm NS do nghỉ việc/thai sản sẽ được thêm thành 1 quá trình mới (Nhóm lý do Giảm)"]
[null,null,null,null,"+ Giảm NS do thay đổi đơn vị, chức danh sẽ được thêm 1 quá trình mới (Nhóm lý do Tăng), KHÔNG THAY ĐỔI lý do tăng/giảm quá trình cũ"]
[]
[]
[null,"HƯỚNG DẪN SƯ DỤNG ĐỐI VỚI NGƯỜI XEM DỮ LIỆU"]
[]
[null,null,"Bước 1:","Chọn năm và tháng xem báo cáo trong sheet \"Report\""]
[]
[null,null,"Bước 2:","Trạng thái làm việc, phòng ban trong sheet \"3.TTNV\" được tự động cập nhật"]

{"sheet":"Define","index":1,"n_rows":22,"n_cols":8,"rows_kept":22,"cut":false,"hidden":false,"merged":[]}
["Tháng thay đổi theo năm chọn",null,"Năm2019","Năm2020","Năm2021","Năm2022","Năm2023","Năm2024"]
[{"$f":"INDIRECT('4.Report'!D4)","v":"2019-01-01"},1,{"$f":"DATE(VALUE(RIGHT(C$1,4)),$B2,1)","v":"2019-01-01"},{"$f":"DATE(VALUE(RIGHT(D$1,4)),$B2,1)","v":"2020-01-01"},"2021-01-01","2022-01-01","2023-01-01","2024-01-01"]
["2019-02-01",2,{"$f":"DATE(VALUE(RIGHT(C$1,4)),$B3,1)","v":"2019-02-01"},"2020-02-01","2021-02-01","2022-02-01","2023-02-01","2024-02-01"]
["2019-03-01",3,"2019-03-01","2020-03-01","2021-03-01","2022-03-01","2023-03-01","2024-03-01"]
["2019-04-01",4,"2019-04-01","2020-04-01","2021-04-01","2022-04-01","2023-04-01","2024-04-01"]
["2019-05-01",5,"2019-05-01","2020-05-01","2021-05-01","2022-05-01","2023-05-01","2024-05-01"]
["2019-06-01",6,"2019-06-01","2020-06-01","2021-06-01","2022-06-01","2023-06-01","2024-06-01"]
["2019-07-01",7,"2019-07-01","2020-07-01","2021-07-01","2022-07-01","2023-07-01","2024-07-01"]
["2019-08-01",8,"2019-08-01","2020-08-01","2021-08-01","2022-08-01","2023-08-01","2024-08-01"]
["2019-09-01",9,"2019-09-01","2020-09-01","2021-09-01","2022-09-01","2023-09-01","2024-09-01"]
["2019-10-01",10,"2019-10-01","2020-10-01","2021-10-01","2022-10-01","2023-10-01","2024-10-01"]
["2019-11-01",11,"2019-11-01","2020-11-01","2021-11-01","2022-11-01","2023-11-01","2024-11-01"]
["2019-12-01",12,"2019-12-01","2020-12-01","2021-12-01","2022-12-01","2023-12-01","2024-12-01"]
[]
[]
[]
["Trạng thái làm việc","Lý do tăng quá trình","Ảnh hưởng tới SL nhân sự đang làm việc","Lý do giảm quá trình","Ảnh hưởng tới SL nhân sự đang làm việc"]
["Đang làm việc","Tăng mới","Tăng","Nghỉ việc","Giảm",null,"Ngày đầu kỳ",1]
["Đã nghỉ việc","Thay đổi đơn vị","Tăng","Nghỉ thai sản","Giảm",null,"Ngày cuối kỳ",2]
["Thai sản","Thay đổi chức danh","Không","Nghỉ không lương dài ngày","Không",null,"Ngày hôm nay",3]
["Không lương","Đi làm lại sau thai sản","Tăng",null,"Giảm",null,"Kỳ được chọn theo BC Nhân sự",4]
[null,"Đi làm lại sau nghỉ không lương dài ngày","Tăng",null,"Giảm"]

{"sheet":"5.Dashboard","index":2,"n_rows":80,"n_cols":13,"rows_kept":80,"cut":false,"hidden":false,"merged":[[1,1,1,13],[5,2,5,3],[5,4,5,6],[5,8,5,9],[5,10,5,12],[79,9,79,11],[57,1,57,13],[64,1,64,13],[3,2,3,4],[66,9,66,11],[7,2,7,3],[7,4,7,6],[7,8,7,9],[7,10,7,12],[9,2,9,3],[9,4,9,6],[9,8,9,9],[9,10,9,12]]}
[]
[null,"BÁO CÁO BIẾN ĐỘNG NHÂN SỰ TOÀN CÔNG TY"]
[]
[null,null,"Chọn năm xem báo cáo",null,null,"Năm2020"]
[]
[null,null,{"$f":"'4.Report'!T10","v":0},null,{"$f":"\"Là số lượng nhân sự ĐẦU năm \" & RIGHT(F4,4)","v":"Là số lượng nhân sự ĐẦU năm 2020"},null,null,null,{"$f":"'4.Report'!W21","v":0},null,{"$f":"\"Là số lượng nhân sự CUỐI năm \" & RIGHT(F4,4)","v":"Là số lượng nhân sự CUỐI năm 2020"}]
[]
[null,null,{"$f":"SUM('4.Report'!U10:U21)","v":0},null,{"$f":"\"Là số lượng NS TUYỂN MỚI trong cả năm \" & RIGHT(F4,4)","v":"Là số lượng NS TUYỂN MỚI trong cả năm 2020"},null,null,null,{"$f":"SUM('4.Report'!V10:V21)","v":0},null,{"$f":"\"Là số lượng NS NGHỈ VIỆC trong cả năm \" &RIGHT(F4,4)","v":"Là số lượng NS NGHỈ VIỆC trong cả năm 2020"}]
[]
[null,null,{"$f":"IFERROR(C8/AVERAGE('4.Report'!T10:T21),\"\")","v":""},null,{"$f":"\"Là tỷ lệ TUYỂN MỚI trung bình cả năm \" &RIGHT(F4,4)","v":"Là tỷ lệ TUYỂN MỚI trung bình cả năm 2020"},null,null,null,{"$f":"IFERROR(I8/AVERAGE('4.Report'!W10:W21),\"\")","v":""},null,{"$f":"\"Là tỷ lệ NGHỈ VIỆC trung bình cả năm \" &RIGHT(F4,4)","v":"Là tỷ lệ NGHỈ VIỆC trung bình cả năm 2020"}]
[]
[]
[]
[]
[]
[]
[]
[]
[]
[]
[]
[]
[]
[]
[]
[]
[]
[]
[]
[]
[]
[]
[]
[]
[]
[]
[]
[]
[]
[]
[]
[]
[]
[]
[]
[]
[]
[]
[]
[]
[]
[]
[]
[]
[]
[]
[]
[null,"BÁO CÁO BIẾN ĐỘNG NHẤN SỰ THEO BỘ PHẬN"]
[]
[]
[]
[]
[]
[]
[null,"CƠ CẤU LAO ĐỘNG TOÀN CÔNG TY"]
[]
[null,"BÁO CÁO TRUNG BÌNH CẢ NĂM",null,null,null,null,null,null,null,"Chọn năm xem báo cáo",null,"Chọn năm xem báo cáo","Năm2020"]
[]
[]
[]
[]
[]
[]
[]
[]
[]
[]
[]
[]
[null,"BÁO CÁO HÀNG THÁNG",null,null,null,null,null,null,null,"Chọn tháng xem báo cáo",null,null,"2020-03-01"]

{"sheet":"DB_Data","index":3,"n_rows":44,"n_cols":18,"rows_kept":44,"cut":false,"hidden":true,"merged":[[36,0,36,1]]}
["Biến động nhân sự theo bộ phận"]
[null,"Chọn phòng",{"$f":"D2-1","v":-4},-3,-2,-1,0,1]
["STT","Nhóm",{"$f":"DATE(IF('5.Dashboard'!$M$67=\"Năm2019\",2019,IF('5.Dashboard'!$M$67=\"Năm2020\",2020)),C2,1)","v":"2019-08-01"},{"$f":"DATE(IF('5.Dashboard'!$M$67=\"Năm2019\",2019,IF('5.Dashboard'!$M$67=\"Năm2020\",2020)),D2,1)","v":"2019-09-01"},{"$f":"DATE(IF('5.Dashboard'!$M$67=\"Năm2019\",2019,IF('5.Dashboard'!$M$67=\"Năm2020\",2020)),E2,1)","v":"2019-10-01"},{"$f":"DATE(IF('5.Dashboard'!$M$67=\"Năm2019\",2019,IF('5.Dashboard'!$M$67=\"Năm2020\",2020)),F2,1)","v":"2019-11-01"},{"$f":"DATE(IF('5.Dashboard'!$M$67=\"Năm2019\",2019,IF('5.Dashboard'!$M$67=\"Năm2020\",2020)),G2,1)","v":"2019-12-01"},{"$f":"DATE(IF('5.Dashboard'!$M$67=\"Năm2019\",2019,IF('5.Dashboard'!$M$67=\"Năm2020\",2020)),H2,1)","v":"2020-01-01"}]
[1,"Trưởng phòng"]
[2,"Content"]
[3,"Ads"]
[4,"Design"]
[]
[]
[]
[]
[]
[]
[]
[]
[]
[]
[]
[]
["Cơ cấu lao động theo giới tính"]
["Cả năm",null,null,null,"SL nhân sự thời điểm cuối tháng",null,null,null,null,null,null,null,"SL nhân sự thời điểm cuối tháng"]
[null,null,null,null,"Xong",null,null,null,null,null,null,null,"Xong"]
["1. Phân theo giới tính",null,null,null,null,null,"2. Phân theo trình độ",null,null,null,null,null,null,null,"3. Phân theo tình trạng hôn nhân"]
["STT","Tháng","Nam","Nữ","Tổng",null,"Tháng","Sau đại học","Đại học","Cao đẳng","PTTH","Chưa có TT","Tổng",null,"Tháng","Độc thân","Đã kết hôn","Tổng"]
[1,{"$f":"DATE(RIGHT('5.Dashboard'!$M$67,4),A25,1)","v":"2020-01-01"},{"$f":"COUNTIFS(INDIRECT('2. QT_LV'!$C$6),\"<>\"&\"Đã nghỉ việc\",INDIRECT('2. QT_LV'!$O$6),\"<=\"&B25,INDIRECT('2. QT_LV'!$P$6),\">=\"&B25,INDIRECT('2. QT_LV'!$W$6),\"Không\",INDIRECT('2. QT_LV'!$Z$6),C$24)\n+COUNTIFS(INDIRECT('2. QT_LV'!$C$6),\"Đã nghỉ việc\",INDIRECT('2. QT_LV'!$O$6),B25,INDIRECT('2. QT_LV'!$Z$6),C$24)\n\n+COUNTIFS(INDIRECT('2. QT_LV'!$O$6),\">=\"&B25,INDIRECT('2. QT_LV'!$O$6),\"<=\"&EOMONTH(B25,0),INDIRECT('2. QT_LV'!$T$6),\"Tăng mới\",INDIRECT('2. QT_LV'!$Z$6),C$24)\n\n-COUNTIFS('3.TTNV'!$AQ:$AQ,\">=\"&B25,'3.TTNV'!$AQ:$AQ,\"<=\"&EOMONTH(B25,0),'3.TTNV'!$E:$E,C$24)","v":0},{"$f":"COUNTIFS(INDIRECT('2. QT_LV'!$C$6),\"<>\"&\"Đã nghỉ việc\",INDIRECT('2. QT_LV'!$O$6),\"<=\"&B25,INDIRECT('2. QT_LV'!$P$6),\">=\"&B25,INDIRECT('2. QT_LV'!$W$6),\"Không\",INDIRECT('2. QT_LV'!$Z$6),D$24)\n+COUNTIFS(INDIRECT('2. QT_LV'!$C$6),\"Đã nghỉ việc\",INDIRECT('2. QT_LV'!$O$6),B25,INDIRECT('2. QT_LV'!$Z$6),D$24)\n\n+COUNTIFS(INDIRECT('2. QT_LV'!$O$6),\">=\"&B25,INDIRECT('2. QT_LV'!$O$6),\"<=\"&EOMONTH(B25,0),INDIRECT('2. QT_LV'!$T$6),\"Tăng mới\",INDIRECT('2. QT_LV'!$Z$6),D$24)\n\n-COUNTIFS('3.TTNV'!$AQ:$AQ,\">=\"&B25,'3.TTNV'!$AQ:$AQ,\"<=\"&EOMONTH(B25,0),'3.TTNV'!$E:$E,D$24)","v":0},{"$f":"SUM(C25:D25)","v":0},null,{"$f":"DATE(RIGHT('5.Dashboard'!$M$67,4),A25,1)","v":"2020-01-01"},{"$f":"COUNTIFS(INDIRECT('2. QT_LV'!$C$6),\"<>\"&\"Đã nghỉ việc\",INDIRECT('2. QT_LV'!$O$6),\"<=\"&$G25,INDIRECT('2. QT_LV'!$P$6),\">=\"&$G25,INDIRECT('2. QT_LV'!$W$6),\"Không\",INDIRECT('2. QT_LV'!$AA$6),H$24)\n+COUNTIFS(INDIRECT('2. QT_LV'!$C$6),\"Đã nghỉ việc\",INDIRECT('2. QT_LV'!$O$6),$G25,INDIRECT('2. QT_LV'!$AA$6),H$24)\n\n+COUNTIFS('2. QT_LV'!$O:$O,\">=\"&$G25,'2. QT_LV'!$O:$O,\"<=\"&EOMONTH($G25,0),'2. QT_LV'!$T:$T,\"Tăng mới\",'2. QT_LV'!$AA:$AA,H$24)\n\n-COUNTIFS('3.TTNV'!$AQ:$AQ,\">=\"&$G25,'3.TTNV'!$AQ:$AQ,\"<=\"&EOMONTH($G25,0),'3.TTNV'!$AE:$AE,H$24)","v":0},{"$f":"COUNTIFS(INDIRECT('2. QT_LV'!$C$6),\"<>\"&\"Đã nghỉ việc\",INDIRECT('2. QT_LV'!$O$6),\"<=\"&$G25,INDIRECT('2. QT_LV'!$P$6),\">=\"&$G25,INDIRECT('2. QT_LV'!$W$6),\"Không\",INDIRECT('2. QT_LV'!$AA$6),I$24)\n+COUNTIFS(INDIRECT('2. QT_LV'!$C$6),\"Đã nghỉ việc\",INDIRECT('2. QT_LV'!$O$6),$G25,INDIRECT('2. QT_LV'!$AA$6),I$24)\n\n+COUNTIFS('2. QT_LV'!$O:$O,\">=\"&$G25,'2. QT_LV'!$O:$O,\"<=\"&EOMONTH($G25,0),'2. QT_LV'!$T:$T,\"Tăng mới\",'2. QT_LV'!$AA:$AA,I$24)\n\n-COUNTIFS('3.TTNV'!$AQ:$AQ,\">=\"&$G25,'3.TTNV'!$AQ:$AQ,\"<=\"&EOMONTH($G25,0),'3.TTNV'!$AE:$AE,I$24)","v":0},{"$f":"COUNTIFS(INDIRECT('2. QT_LV'!$C$6),\"<>\"&\"Đã nghỉ việc\",INDIRECT('2. QT_LV'!$O$6),\"<=\"&$G25,INDIRECT('2. QT_LV'!$P$6),\">=\"&$G25,INDIRECT('2. QT_LV'!$W$6),\"Không\",INDIRECT('2. QT_LV'!$AA$6),J$24)\n+COUNTIFS(INDIRECT('2. QT_LV'!$C$6),\"Đã nghỉ việc\",INDIRECT('2. QT_LV'!$O$6),$G25,INDIRECT('2. QT_LV'!$AA$6),J$24)\n\n+COUNTIFS('2. QT_LV'!$O:$O,\">=\"&$G25,'2. QT_LV'!$O:$O,\"<=\"&EOMONTH($G25,0),'2. QT_LV'!$T:$T,\"Tăng mới\",'2. QT_LV'!$AA:$AA,J$24)\n\n-COUNTIFS('3.TTNV'!$AQ:$AQ,\">=\"&$G25,'3.TTNV'!$AQ:$AQ,\"<=\"&EOMONTH($G25,0),'3.TTNV'!$AE:$AE,J$24)","v":0},{"$f":"COUNTIFS(INDIRECT('2. QT_LV'!$C$6),\"<>\"&\"Đã nghỉ việc\",INDIRECT('2. QT_LV'!$O$6),\"<=\"&$G25,INDIRECT('2. QT_LV'!$P$6),\">=\"&$G25,INDIRECT('2. QT_LV'!$W$6),\"Không\",INDIRECT('2. QT_LV'!$AA$6),K$24)\n+COUNTIFS(INDIRECT('2. QT_LV'!$C$6),\"Đã nghỉ việc\",INDIRECT('2. QT_LV'!$O$6),$G25,INDIRECT('2. QT_LV'!$AA$6),K$24)\n\n+COUNTIFS('2. QT_LV'!$O:$O,\">=\"&$G25,'2. QT_LV'!$O:$O,\"<=\"&EOMONTH($G25,0),'2. QT_LV'!$T:$T,\"Tăng mới\",'2. QT_LV'!$AA:$AA,K$24)\n\n-COUNTIFS('3.TTNV'!$AQ:$AQ,\">=\"&$G25,'3.TTNV'!$AQ:$AQ,\"<=\"&EOMONTH($G25,0),'3.TTNV'!$AE:$AE,K$24)","v":0},{"$f":"COUNTIFS(INDIRECT('2. QT_LV'!$C$6),\"<>\"&\"Đã nghỉ việc\",INDIRECT('2. QT_LV'!$O$6),\"<=\"&$G25,INDIRECT('2. QT_LV'!$P$6),\">=\"&$G25,INDIRECT('2. QT_LV'!$W$6),\"Không\",INDIRECT('2. QT_LV'!$AA$6),L$24)\n+COUNTIFS(INDIRECT('2. QT_LV'!$C$6),\"Đã nghỉ việc\",INDIRECT('2. QT_LV'!$O$6),$G25,INDIRECT('2. QT_LV'!$AA$6),L$24)\n\n+COUNTIFS('2. QT_LV'!$O:$O,\">=\"&$G25,'2. QT_LV'!$O:$O,\"<=\"&EOMONTH($G25,0),'2. QT_LV'!$T:$T,\"Tăng mới\",'2. QT_LV'!$AA:$AA,L$24)\n\n-COUNTIFS('3.TTNV'!$AQ:$AQ,\">=\"&$G25,'3.TTNV'!$AQ:$AQ,\"<=\"&EOMONTH($G25,0),'3.TTNV'!$AE:$AE,L$24)","v":0},{"$f":"SUM(H25:L25)","v":0},null,{"$f":"DATE(RIGHT('5.Dashboard'!$M$67,4),A25,1)","v":"2020-01-01"},{"$f":"COUNTIFS(INDIRECT('2. QT_LV'!$C$6),\"<>\"&\"Đã nghỉ việc\",INDIRECT('2. QT_LV'!$O$6),\"<=\"&EOMONTH($O25,0),INDIRECT('2. QT_LV'!$P$6),\">=\"&$O25,INDIRECT('2. QT_LV'!$AB$6),P$24)","v":0},{"$f":"COUNTIFS(INDIRECT('2. QT_LV'!$C$6),\"<>\"&\"Đã nghỉ việc\",INDIRECT('2. QT_LV'!$O$6),\"<=\"&EOMONTH($O25,0),INDIRECT('2. QT_LV'!$P$6),\">=\"&$O25,INDIRECT('2. QT_LV'!$AB$6),Q$24)","v":0},{"$f":"SUM(P25:Q25)","v":0}]
[2,{"$f":"DATE(RIGHT('5.Dashboard'!$M$67,4),A26,1)","v":"2020-02-01"},{"$f":"COUNTIFS(INDIRECT('2. QT_LV'!$C$6),\"<>\"&\"Đã nghỉ việc\",INDIRECT('2. QT_LV'!$O$6),\"<=\"&B26,INDIRECT('2. QT_LV'!$P$6),\">=\"&B26,INDIRECT('2. QT_LV'!$W$6),\"Không\",INDIRECT('2. QT_LV'!$Z$6),C$24)\n+COUNTIFS(INDIRECT('2. QT_LV'!$C$6),\"Đã nghỉ việc\",INDIRECT('2. QT_LV'!$O$6),B26,INDIRECT('2. QT_LV'!$Z$6),C$24)\n\n+COUNTIFS(INDIRECT('2. QT_LV'!$O$6),\">=\"&B26,INDIRECT('2. QT_LV'!$O$6),\"<=\"&EOMONTH(B26,0),INDIRECT('2. QT_LV'!$T$6),\"Tăng mới\",INDIRECT('2. QT_LV'!$Z$6),C$24)\n\n-COUNTIFS('3.TTNV'!$AQ:$AQ,\">=\"&B26,'3.TTNV'!$AQ:$AQ,\"<=\"&EOMONTH(B26,0),'3.TTNV'!$E:$E,C$24)","v":0},{"$f":"COUNTIFS(INDIRECT('2. QT_LV'!$C$6),\"<>\"&\"Đã nghỉ việc\",INDIRECT('2. QT_LV'!$O$6),\"<=\"&B26,INDIRECT('2. QT_LV'!$P$6),\">=\"&B26,INDIRECT('2. QT_LV'!$W$6),\"Không\",INDIRECT('2. QT_LV'!$Z$6),D$24)\n+COUNTIFS(INDIRECT('2. QT_LV'!$C$6),\"Đã nghỉ việc\",INDIRECT('2. QT_LV'!$O$6),B26,INDIRECT('2. QT_LV'!$Z$6),D$24)\n\n+COUNTIFS(INDIRECT('2. QT_LV'!$O$6),\">=\"&B26,INDIRECT('2. QT_LV'!$O$6),\"<=\"&EOMONTH(B26,0),INDIRECT('2. QT_LV'!$T$6),\"Tăng mới\",INDIRECT('2. QT_LV'!$Z$6),D$24)\n\n-COUNTIFS('3.TTNV'!$AQ:$AQ,\">=\"&B26,'3.TTNV'!$AQ:$AQ,\"<=\"&EOMONTH(B26,0),'3.TTNV'!$E:$E,D$24)","v":0},0,null,{"$f":"DATE(RIGHT('5.Dashboard'!$M$67,4),A26,1)","v":"2020-02-01"},{"$f":"COUNTIFS(INDIRECT('2. QT_LV'!$C$6),\"<>\"&\"Đã nghỉ việc\",INDIRECT('2. QT_LV'!$O$6),\"<=\"&$G26,INDIRECT('2. QT_LV'!$P$6),\">=\"&$G26,INDIRECT('2. QT_LV'!$W$6),\"Không\",INDIRECT('2. QT_LV'!$AA$6),H$24)\n+COUNTIFS(INDIRECT('2. QT_LV'!$C$6),\"Đã nghỉ việc\",INDIRECT('2. QT_LV'!$O$6),$G26,INDIRECT('2. QT_LV'!$AA$6),H$24)\n\n+COUNTIFS('2. QT_LV'!$O:$O,\">=\"&$G26,'2. QT_LV'!$O:$O,\"<=\"&EOMONTH($G26,0),'2. QT_LV'!$T:$T,\"Tăng mới\",'2. QT_LV'!$AA:$AA,H$24)\n\n-COUNTIFS('3.TTNV'!$AQ:$AQ,\">=\"&$G26,'3.TTNV'!$AQ:$AQ,\"<=\"&EOMONTH($G26,0),'3.TTNV'!$AE:$AE,H$24)","v":0},{"$f":"COUNTIFS(INDIRECT('2. QT_LV'!$C$6),\"<>\"&\"Đã nghỉ việc\",INDIRECT('2. QT_LV'!$O$6),\"<=\"&$G26,INDIRECT('2. QT_LV'!$P$6),\">=\"&$G26,INDIRECT('2. QT_LV'!$W$6),\"Không\",INDIRECT('2. QT_LV'!$AA$6),I$24)\n+COUNTIFS(INDIRECT('2. QT_LV'!$C$6),\"Đã nghỉ việc\",INDIRECT('2. QT_LV'!$O$6),$G26,INDIRECT('2. QT_LV'!$AA$6),I$24)\n\n+COUNTIFS('2. QT_LV'!$O:$O,\">=\"&$G26,'2. QT_LV'!$O:$O,\"<=\"&EOMONTH($G26,0),'2. QT_LV'!$T:$T,\"Tăng mới\",'2. QT_LV'!$AA:$AA,I$24)\n\n-COUNTIFS('3.TTNV'!$AQ:$AQ,\">=\"&$G26,'3.TTNV'!$AQ:$AQ,\"<=\"&EOMONTH($G26,0),'3.TTNV'!$AE:$AE,I$24)","v":0},{"$f":"COUNTIFS(INDIRECT('2. QT_LV'!$C$6),\"<>\"&\"Đã nghỉ việc\",INDIRECT('2. QT_LV'!$O$6),\"<=\"&$G26,INDIRECT('2. QT_LV'!$P$6),\">=\"&$G26,INDIRECT('2. QT_LV'!$W$6),\"Không\",INDIRECT('2. QT_LV'!$AA$6),J$24)\n+COUNTIFS(INDIRECT('2. QT_LV'!$C$6),\"Đã nghỉ việc\",INDIRECT('2. QT_LV'!$O$6),$G26,INDIRECT('2. QT_LV'!$AA$6),J$24)\n\n+COUNTIFS('2. QT_LV'!$O:$O,\">=\"&$G26,'2. QT_LV'!$O:$O,\"<=\"&EOMONTH($G26,0),'2. QT_LV'!$T:$T,\"Tăng mới\",'2. QT_LV'!$AA:$AA,J$24)\n\n-COUNTIFS('3.TTNV'!$AQ:$AQ,\">=\"&$G26,'3.TTNV'!$AQ:$AQ,\"<=\"&EOMONTH($G26,0),'3.TTNV'!$AE:$AE,J$24)","v":0},{"$f":"COUNTIFS(INDIRECT('2. QT_LV'!$C$6),\"<>\"&\"Đã nghỉ việc\",INDIRECT('2. QT_LV'!$O$6),\"<=\"&$G26,INDIRECT('2. QT_LV'!$P$6),\">=\"&$G26,INDIRECT('2. QT_LV'!$W$6),\"Không\",INDIRECT('2. QT_LV'!$AA$6),K$24)\n+COUNTIFS(INDIRECT('2. QT_LV'!$C$6),\"Đã nghỉ việc\",INDIRECT('2. QT_LV'!$O$6),$G26,INDIRECT('2. QT_LV'!$AA$6),K$24)\n\n+COUNTIFS('2. QT_LV'!$O:$O,\">=\"&$G26,'2. QT_LV'!$O:$O,\"<=\"&EOMONTH($G26,0),'2. QT_LV'!$T:$T,\"Tăng mới\",'2. QT_LV'!$AA:$AA,K$24)\n\n-COUNTIFS('3.TTNV'!$AQ:$AQ,\">=\"&$G26,'3.TTNV'!$AQ:$AQ,\"<=\"&EOMONTH($G26,0),'3.TTNV'!$AE:$AE,K$24)","v":0},{"$f":"COUNTIFS(INDIRECT('2. QT_LV'!$C$6),\"<>\"&\"Đã nghỉ việc\",INDIRECT('2. QT_LV'!$O$6),\"<=\"&$G26,INDIRECT('2. QT_LV'!$P$6),\">=\"&$G26,INDIRECT('2. QT_LV'!$W$6),\"Không\",INDIRECT('2. QT_LV'!$AA$6),L$24)\n+COUNTIFS(INDIRECT('2. QT_LV'!$C$6),\"Đã nghỉ việc\",INDIRECT('2. QT_LV'!$O$6),$G26,INDIRECT('2. QT_LV'!$AA$6),L$24)\n\n+COUNTIFS('2. QT_LV'!$O:$O,\">=\"&$G26,'2. QT_LV'!$O:$O,\"<=\"&EOMONTH($G26,0),'2. QT_LV'!$T:$T,\"Tăng mới\",'2. QT_LV'!$AA:$AA,L$24)\n\n-COUNTIFS('3.TTNV'!$AQ:$AQ,\">=\"&$G26,'3.TTNV'!$AQ:$AQ,\"<=\"&EOMONTH($G26,0),'3.TTNV'!$AE:$AE,L$24)","v":0},0,null,{"$f":"DATE(RIGHT('5.Dashboard'!$M$67,4),A26,1)","v":"2020-02-01"},{"$f":"COUNTIFS(INDIRECT('2. QT_LV'!$C$6),\"<>\"&\"Đã nghỉ việc\",INDIRECT('2. QT_LV'!$O$6),\"<=\"&EOMONTH($O26,0),INDIRECT('2. QT_LV'!$P$6),\">=\"&$O26,INDIRECT('2. QT_LV'!$AB$6),P$24)","v":0},{"$f":"COUNTIFS(INDIRECT('2. QT_LV'!$C$6),\"<>\"&\"Đã nghỉ việc\",INDIRECT('2. QT_LV'!$O$6),\"<=\"&EOMONTH($O26,0),INDIRECT('2. QT_LV'!$P$6),\">=\"&$O26,INDIRECT('2. QT_LV'!$AB$6),Q$24)","v":0},0]
[3,{"$f":"DATE(RIGHT('5.Dashboard'!$M$67,4),A27,1)","v":"2020-03-01"},{"$f":"COUNTIFS(INDIRECT('2. QT_LV'!$C$6),\"<>\"&\"Đã nghỉ việc\",INDIRECT('2. QT_LV'!$O$6),\"<=\"&B27,INDIRECT('2. QT_LV'!$P$6),\">=\"&B27,INDIRECT('2. QT_LV'!$W$6),\"Không\",INDIRECT('2. QT_LV'!$Z$6),C$24)\n+COUNTIFS(INDIRECT('2. QT_LV'!$C$6),\"Đã nghỉ việc\",INDIRECT('2. QT_LV'!$O$6),B27,INDIRECT('2. QT_LV'!$Z$6),C$24)\n\n+COUNTIFS(INDIRECT('2. QT_LV'!$O$6),\">=\"&B27,INDIRECT('2. QT_LV'!$O$6),\"<=\"&EOMONTH(B27,0),INDIRECT('2. QT_LV'!$T$6),\"Tăng mới\",INDIRECT('2. QT_LV'!$Z$6),C$24)\n\n-COUNTIFS('3.TTNV'!$AQ:$AQ,\">=\"&B27,'3.TTNV'!$AQ:$AQ,\"<=\"&EOMONTH(B27,0),'3.TTNV'!$E:$E,C$24)","v":0},{"$f":"COUNTIFS(INDIRECT('2. QT_LV'!$C$6),\"<>\"&\"Đã nghỉ việc\",INDIRECT('2. QT_LV'!$O$6),\"<=\"&B27,INDIRECT('2. QT_LV'!$P$6),\">=\"&B27,INDIRECT('2. QT_LV'!$W$6),\"Không\",INDIRECT('2. QT_LV'!$Z$6),D$24)\n+COUNTIFS(INDIRECT('2. QT_LV'!$C$6),\"Đã nghỉ việc\",INDIRECT('2. QT_LV'!$O$6),B27,INDIRECT('2. QT_LV'!$Z$6),D$24)\n\n+COUNTIFS(INDIRECT('2. QT_LV'!$O$6),\">=\"&B27,INDIRECT('2. QT_LV'!$O$6),\"<=\"&EOMONTH(B27,0),INDIRECT('2. QT_LV'!$T$6),\"Tăng mới\",INDIRECT('2. QT_LV'!$Z$6),D$24)\n\n-COUNTIFS('3.TTNV'!$AQ:$AQ,\">=\"&B27,'3.TTNV'!$AQ:$AQ,\"<=\"&EOMONTH(B27,0),'3.TTNV'!$E:$E,D$24)","v":0},0,null,{"$f":"DATE(RIGHT('5.Dashboard'!$M$67,4),A27,1)","v":"2020-03-01"},{"$f":"COUNTIFS(INDIRECT('2. QT_LV'!$C$6),\"<>\"&\"Đã nghỉ việc\",INDIRECT('2. QT_LV'!$O$6),\"<=\"&$G27,INDIRECT('2. QT_LV'!$P$6),\">=\"&$G27,INDIRECT('2. QT_LV'!$W$6),\"Không\",INDIRECT('2. QT_LV'!$AA$6),H$24)\n+COUNTIFS(INDIRECT('2. QT_LV'!$C$6),\"Đã nghỉ việc\",INDIRECT('2. QT_LV'!$O$6),$G27,INDIRECT('2. QT_LV'!$AA$6),H$24)\n\n+COUNTIFS('2. QT_LV'!$O:$O,\">=\"&$G27,'2. QT_LV'!$O:$O,\"<=\"&EOMONTH($G27,0),'2. QT_LV'!$T:$T,\"Tăng mới\",'2. QT_LV'!$AA:$AA,H$24)\n\n-COUNTIFS('3.TTNV'!$AQ:$AQ,\">=\"&$G27,'3.TTNV'!$AQ:$AQ,\"<=\"&EOMONTH($G27,0),'3.TTNV'!$AE:$AE,H$24)","v":0},{"$f":"COUNTIFS(INDIRECT('2. QT_LV'!$C$6),\"<>\"&\"Đã nghỉ việc\",INDIRECT('2. QT_LV'!$O$6),\"<=\"&$G27,INDIRECT('2. QT_LV'!$P$6),\">=\"&$G27,INDIRECT('2. QT_LV'!$W$6),\"Không\",INDIRECT('2. QT_LV'!$AA$6),I$24)\n+COUNTIFS(INDIRECT('2. QT_LV'!$C$6),\"Đã nghỉ việc\",INDIRECT('2. QT_LV'!$O$6),$G27,INDIRECT('2. QT_LV'!$AA$6),I$24)\n\n+COUNTIFS('2. QT_LV'!$O:$O,\">=\"&$G27,'2. QT_LV'!$O:$O,\"<=\"&EOMONTH($G27,0),'2. QT_LV'!$T:$T,\"Tăng mới\",'2. QT_LV'!$AA:$AA,I$24)\n\n-COUNTIFS('3.TTNV'!$AQ:$AQ,\">=\"&$G27,'3.TTNV'!$AQ:$AQ,\"<=\"&EOMONTH($G27,0),'3.TTNV'!$AE:$AE,I$24)","v":0},{"$f":"COUNTIFS(INDIRECT('2. QT_LV'!$C$6),\"<>\"&\"Đã nghỉ việc\",INDIRECT('2. QT_LV'!$O$6),\"<=\"&$G27,INDIRECT('2. QT_LV'!$P$6),\">=\"&$G27,INDIRECT('2. QT_LV'!$W$6),\"Không\",INDIRECT('2. QT_LV'!$AA$6),J$24)\n+COUNTIFS(INDIRECT('2. QT_LV'!$C$6),\"Đã nghỉ việc\",INDIRECT('2. QT_LV'!$O$6),$G27,INDIRECT('2. QT_LV'!$AA$6),J$24)\n\n+COUNTIFS('2. QT_LV'!$O:$O,\">=\"&$G27,'2. QT_LV'!$O:$O,\"<=\"&EOMONTH($G27,0),'2. QT_LV'!$T:$T,\"Tăng mới\",'2. QT_LV'!$AA:$AA,J$24)\n\n-COUNTIFS('3.TTNV'!$AQ:$AQ,\">=\"&$G27,'3.TTNV'!$AQ:$AQ,\"<=\"&EOMONTH($G27,0),'3.TTNV'!$AE:$AE,J$24)","v":0},{"$f":"COUNTIFS(INDIRECT('2. QT_LV'!$C$6),\"<>\"&\"Đã nghỉ việc\",INDIRECT('2. QT_LV'!$O$6),\"<=\"&$G27,INDIRECT('2. QT_LV'!$P$6),\">=\"&$G27,INDIRECT('2. QT_LV'!$W$6),\"Không\",INDIRECT('2. QT_LV'!$AA$6),K$24)\n+COUNTIFS(INDIRECT('2. QT_LV'!$C$6),\"Đã nghỉ việc\",INDIRECT('2. QT_LV'!$O$6),$G27,INDIRECT('2. QT_LV'!$AA$6),K$24)\n\n+COUNTIFS('2. QT_LV'!$O:$O,\">=\"&$G27,'2. QT_LV'!$O:$O,\"<=\"&EOMONTH($G27,0),'2. QT_LV'!$T:$T,\"Tăng mới\",'2. QT_LV'!$AA:$AA,K$24)\n\n-COUNTIFS('3.TTNV'!$AQ:$AQ,\">=\"&$G27,'3.TTNV'!$AQ:$AQ,\"<=\"&EOMONTH($G27,0),'3.TTNV'!$AE:$AE,K$24)","v":0},{"$f":"COUNTIFS(INDIRECT('2. QT_LV'!$C$6),\"<>\"&\"Đã nghỉ việc\",INDIRECT('2. QT_LV'!$O$6),\"<=\"&$G27,INDIRECT('2. QT_LV'!$P$6),\">=\"&$G27,INDIRECT('2. QT_LV'!$W$6),\"Không\",INDIRECT('2. QT_LV'!$AA$6),L$24)\n+COUNTIFS(INDIRECT('2. QT_LV'!$C$6),\"Đã nghỉ việc\",INDIRECT('2. QT_LV'!$O$6),$G27,INDIRECT('2. QT_LV'!$AA$6),L$24)\n\n+COUNTIFS('2. QT_LV'!$O:$O,\">=\"&$G27,'2. QT_LV'!$O:$O,\"<=\"&EOMONTH($G27,0),'2. QT_LV'!$T:$T,\"Tăng mới\",'2. QT_LV'!$AA:$AA,L$24)\n\n-COUNTIFS('3.TTNV'!$AQ:$AQ,\">=\"&$G27,'3.TTNV'!$AQ:$AQ,\"<=\"&EOMONTH($G27,0),'3.TTNV'!$AE:$AE,L$24)","v":0},0,null,{"$f":"DATE(RIGHT('5.Dashboard'!$M$67,4),A27,1)","v":"2020-03-01"},{"$f":"COUNTIFS(INDIRECT('2. QT_LV'!$C$6),\"<>\"&\"Đã nghỉ việc\",INDIRECT('2. QT_LV'!$O$6),\"<=\"&EOMONTH($O27,0),INDIRECT('2. QT_LV'!$P$6),\">=\"&$O27,INDIRECT('2. QT_LV'!$AB$6),P$24)","v":0},{"$f":"COUNTIFS(INDIRECT('2. QT_LV'!$C$6),\"<>\"&\"Đã nghỉ việc\",INDIRECT('2. QT_LV'!$O$6),\"<=\"&EOMONTH($O27,0),INDIRECT('2. QT_LV'!$P$6),\">=\"&$O27,INDIRECT('2. QT_LV'!$AB$6),Q$24)","v":0},0]
[4,{"$f":"DATE(RIGHT('5.Dashboard'!$M$67,4),A28,1)","v":"2020-04-01"},{"$f":"COUNTIFS(INDIRECT('2. QT_LV'!$C$6),\"<>\"&\"Đã nghỉ việc\",INDIRECT('2. QT_LV'!$O$6),\"<=\"&B28,INDIRECT('2. QT_LV'!$P$6),\">=\"&B28,INDIRECT('2. QT_LV'!$W$6),\"Không\",INDIRECT('2. QT_LV'!$Z$6),C$24)\n+COUNTIFS(INDIRECT('2. QT_LV'!$C$6),\"Đã nghỉ việc\",INDIRECT('2. QT_LV'!$O$6),B28,INDIRECT('2. QT_LV'!$Z$6),C$24)\n\n+COUNTIFS(INDIRECT('2. QT_LV'!$O$6),\">=\"&B28,INDIRECT('2. QT_LV'!$O$6),\"<=\"&EOMONTH(B28,0),INDIRECT('2. QT_LV'!$T$6),\"Tăng mới\",INDIRECT('2. QT_LV'!$Z$6),C$24)\n\n-COUNTIFS('3.TTNV'!$AQ:$AQ,\">=\"&B28,'3.TTNV'!$AQ:$AQ,\"<=\"&EOMONTH(B28,0),'3.TTNV'!$E:$E,C$24)","v":0},{"$f":"COUNTIFS(INDIRECT('2. QT_LV'!$C$6),\"<>\"&\"Đã nghỉ việc\",INDIRECT('2. QT_LV'!$O$6),\"<=\"&B28,INDIRECT('2. QT_LV'!$P$6),\">=\"&B28,INDIRECT('2. QT_LV'!$W$6),\"Không\",INDIRECT('2. QT_LV'!$Z$6),D$24)\n+COUNTIFS(INDIRECT('2. QT_LV'!$C$6),\"Đã nghỉ việc\",INDIRECT('2. QT_LV'!$O$6),B28,INDIRECT('2. QT_LV'!$Z$6),D$24)\n\n+COUNTIFS(INDIRECT('2. QT_LV'!$O$6),\">=\"&B28,INDIRECT('2. QT_LV'!$O$6),\"<=\"&EOMONTH(B28,0),INDIRECT('2. QT_LV'!$T$6),\"Tăng mới\",INDIRECT('2. QT_LV'!$Z$6),D$24)\n\n-COUNTIFS('3.TTNV'!$AQ:$AQ,\">=\"&B28,'3.TTNV'!$AQ:$AQ,\"<=\"&EOMONTH(B28,0),'3.TTNV'!$E:$E,D$24)","v":0},0,null,{"$f":"DATE(RIGHT('5.Dashboard'!$M$67,4),A28,1)","v":"2020-04-01"},{"$f":"COUNTIFS(INDIRECT('2. QT_LV'!$C$6),\"<>\"&\"Đã nghỉ việc\",INDIRECT('2. QT_LV'!$O$6),\"<=\"&$G28,INDIRECT('2. QT_LV'!$P$6),\">=\"&$G28,INDIRECT('2. QT_LV'!$W$6),\"Không\",INDIRECT('2. QT_LV'!$AA$6),H$24)\n+COUNTIFS(INDIRECT('2. QT_LV'!$C$6),\"Đã nghỉ việc\",INDIRECT('2. QT_LV'!$O$6),$G28,INDIRECT('2. QT_LV'!$AA$6),H$24)\n\n+COUNTIFS('2. QT_LV'!$O:$O,\">=\"&$G28,'2. QT_LV'!$O:$O,\"<=\"&EOMONTH($G28,0),'2. QT_LV'!$T:$T,\"Tăng mới\",'2. QT_LV'!$AA:$AA,H$24)\n\n-COUNTIFS('3.TTNV'!$AQ:$AQ,\">=\"&$G28,'3.TTNV'!$AQ:$AQ,\"<=\"&EOMONTH($G28,0),'3.TTNV'!$AE:$AE,H$24)","v":0},{"$f":"COUNTIFS(INDIRECT('2. QT_LV'!$C$6),\"<>\"&\"Đã nghỉ việc\",INDIRECT('2. QT_LV'!$O$6),\"<=\"&$G28,INDIRECT('2. QT_LV'!$P$6),\">=\"&$G28,INDIRECT('2. QT_LV'!$W$6),\"Không\",INDIRECT('2. QT_LV'!$AA$6),I$24)\n+COUNTIFS(INDIRECT('2. QT_LV'!$C$6),\"Đã nghỉ việc\",INDIRECT('2. QT_LV'!$O$6),$G28,INDIRECT('2. QT_LV'!$AA$6),I$24)\n\n+COUNTIFS('2. QT_LV'!$O:$O,\">=\"&$G28,'2. QT_LV'!$O:$O,\"<=\"&EOMONTH($G28,0),'2. QT_LV'!$T:$T,\"Tăng mới\",'2. QT_LV'!$AA:$AA,I$24)\n\n-COUNTIFS('3.TTNV'!$AQ:$AQ,\">=\"&$G28,'3.TTNV'!$AQ:$AQ,\"<=\"&EOMONTH($G28,0),'3.TTNV'!$AE:$AE,I$24)","v":0},{"$f":"COUNTIFS(INDIRECT('2. QT_LV'!$C$6),\"<>\"&\"Đã nghỉ việc\",INDIRECT('2. QT_LV'!$O$6),\"<=\"&$G28,INDIRECT('2. QT_LV'!$P$6),\">=\"&$G28,INDIRECT('2. QT_LV'!$W$6),\"Không\",INDIRECT('2. QT_LV'!$AA$6),J$24)\n+COUNTIFS(INDIRECT('2. QT_LV'!$C$6),\"Đã nghỉ việc\",INDIRECT('2. QT_LV'!$O$6),$G28,INDIRECT('2. QT_LV'!$AA$6),J$24)\n\n+COUNTIFS('2. QT_LV'!$O:$O,\">=\"&$G28,'2. QT_LV'!$O:$O,\"<=\"&EOMONTH($G28,0),'2. QT_LV'!$T:$T,\"Tăng mới\",'2. QT_LV'!$AA:$AA,J$24)\n\n-COUNTIFS('3.TTNV'!$AQ:$AQ,\">=\"&$G28,'3.TTNV'!$AQ:$AQ,\"<=\"&EOMONTH($G28,0),'3.TTNV'!$AE:$AE,J$24)","v":0},{"$f":"COUNTIFS(INDIRECT('2. QT_LV'!$C$6),\"<>\"&\"Đã nghỉ việc\",INDIRECT('2. QT_LV'!$O$6),\"<=\"&$G28,INDIRECT('2. QT_LV'!$P$6),\">=\"&$G28,INDIRECT('2. QT_LV'!$W$6),\"Không\",INDIRECT('2. QT_LV'!$AA$6),K$24)\n+COUNTIFS(INDIRECT('2. QT_LV'!$C$6),\"Đã nghỉ việc\",INDIRECT('2. QT_LV'!$O$6),$G28,INDIRECT('2. QT_LV'!$AA$6),K$24)\n\n+COUNTIFS('2. QT_LV'!$O:$O,\">=\"&$G28,'2. QT_LV'!$O:$O,\"<=\"&EOMONTH($G28,0),'2. QT_LV'!$T:$T,\"Tăng mới\",'2. QT_LV'!$AA:$AA,K$24)\n\n-COUNTIFS('3.TTNV'!$AQ:$AQ,\">=\"&$G28,'3.TTNV'!$AQ:$AQ,\"<=\"&EOMONTH($G28,0),'3.TTNV'!$AE:$AE,K$24)","v":0},{"$f":"COUNTIFS(INDIRECT('2. QT_LV'!$C$6),\"<>\"&\"Đã nghỉ việc\",INDIRECT('2. QT_LV'!$O$6),\"<=\"&$G28,INDIRECT('2. QT_LV'!$P$6),\">=\"&$G28,INDIRECT('2. QT_LV'!$W$6),\"Không\",INDIRECT('2. QT_LV'!$AA$6),L$24)\n+COUNTIFS(INDIRECT('2. QT_LV'!$C$6),\"Đã nghỉ việc\",INDIRECT('2. QT_LV'!$O$6),$G28,INDIRECT('2. QT_LV'!$AA$6),L$24)\n\n+COUNTIFS('2. QT_LV'!$O:$O,\">=\"&$G28,'2. QT_LV'!$O:$O,\"<=\"&EOMONTH($G28,0),'2. QT_LV'!$T:$T,\"Tăng mới\",'2. QT_LV'!$AA:$AA,L$24)\n\n-COUNTIFS('3.TTNV'!$AQ:$AQ,\">=\"&$G28,'3.TTNV'!$AQ:$AQ,\"<=\"&EOMONTH($G28,0),'3.TTNV'!$AE:$AE,L$24)","v":0},0,null,{"$f":"DATE(RIGHT('5.Dashboard'!$M$67,4),A28,1)","v":"2020-04-01"},{"$f":"COUNTIFS(INDIRECT('2. QT_LV'!$C$6),\"<>\"&\"Đã nghỉ việc\",INDIRECT('2. QT_LV'!$O$6),\"<=\"&EOMONTH($O28,0),INDIRECT('2. QT_LV'!$P$6),\">=\"&$O28,INDIRECT('2. QT_LV'!$AB$6),P$24)","v":0},{"$f":"COUNTIFS(INDIRECT('2. QT_LV'!$C$6),\"<>\"&\"Đã nghỉ việc\",INDIRECT('2. QT_LV'!$O$6),\"<=\"&EOMONTH($O28,0),INDIRECT('2. QT_LV'!$P$6),\">=\"&$O28,INDIRECT('2. QT_LV'!$AB$6),Q$24)","v":0},0]
[5,{"$f":"DATE(RIGHT('5.Dashboard'!$M$67,4),A29,1)","v":"2020-05-01"},{"$f":"COUNTIFS(INDIRECT('2. QT_LV'!$C$6),\"<>\"&\"Đã nghỉ việc\",INDIRECT('2. QT_LV'!$O$6),\"<=\"&B29,INDIRECT('2. QT_LV'!$P$6),\">=\"&B29,INDIRECT('2. QT_LV'!$W$6),\"Không\",INDIRECT('2. QT_LV'!$Z$6),C$24)\n+COUNTIFS(INDIRECT('2. QT_LV'!$C$6),\"Đã nghỉ việc\",INDIRECT('2. QT_LV'!$O$6),B29,INDIRECT('2. QT_LV'!$Z$6),C$24)\n\n+COUNTIFS(INDIRECT('2. QT_LV'!$O$6),\">=\"&B29,INDIRECT('2. QT_LV'!$O$6),\"<=\"&EOMONTH(B29,0),INDIRECT('2. QT_LV'!$T$6),\"Tăng mới\",INDIRECT('2. QT_LV'!$Z$6),C$24)\n\n-COUNTIFS('3.TTNV'!$AQ:$AQ,\">=\"&B29,'3.TTNV'!$AQ:$AQ,\"<=\"&EOMONTH(B29,0),'3.TTNV'!$E:$E,C$24)","v":0},{"$f":"COUNTIFS(INDIRECT('2. QT_LV'!$C$6),\"<>\"&\"Đã nghỉ việc\",INDIRECT('2. QT_LV'!$O$6),\"<=\"&B29,INDIRECT('2. QT_LV'!$P$6),\">=\"&B29,INDIRECT('2. QT_LV'!$W$6),\"Không\",INDIRECT('2. QT_LV'!$Z$6),D$24)\n+COUNTIFS(INDIRECT('2. QT_LV'!$C$6),\"Đã nghỉ việc\",INDIRECT('2. QT_LV'!$O$6),B29,INDIRECT('2. QT_LV'!$Z$6),D$24)\n\n+COUNTIFS(INDIRECT('2. QT_LV'!$O$6),\">=\"&B29,INDIRECT('2. QT_LV'!$O$6),\"<=\"&EOMONTH(B29,0),INDIRECT('2. QT_LV'!$T$6),\"Tăng mới\",INDIRECT('2. QT_LV'!$Z$6),D$24)\n\n-COUNTIFS('3.TTNV'!$AQ:$AQ,\">=\"&B29,'3.TTNV'!$AQ:$AQ,\"<=\"&EOMONTH(B29,0),'3.TTNV'!$E:$E,D$24)","v":0},0,null,{"$f":"DATE(RIGHT('5.Dashboard'!$M$67,4),A29,1)","v":"2020-05-01"},{"$f":"COUNTIFS(INDIRECT('2. QT_LV'!$C$6),\"<>\"&\"Đã nghỉ việc\",INDIRECT('2. QT_LV'!$O$6),\"<=\"&$G29,INDIRECT('2. QT_LV'!$P$6),\">=\"&$G29,INDIRECT('2. QT_LV'!$W$6),\"Không\",INDIRECT('2. QT_LV'!$AA$6),H$24)\n+COUNTIFS(INDIRECT('2. QT_LV'!$C$6),\"Đã nghỉ việc\",INDIRECT('2. QT_LV'!$O$6),$G29,INDIRECT('2. QT_LV'!$AA$6),H$24)\n\n+COUNTIFS('2. QT_LV'!$O:$O,\">=\"&$G29,'2. QT_LV'!$O:$O,\"<=\"&EOMONTH($G29,0),'2. QT_LV'!$T:$T,\"Tăng mới\",'2. QT_LV'!$AA:$AA,H$24)\n\n-COUNTIFS('3.TTNV'!$AQ:$AQ,\">=\"&$G29,'3.TTNV'!$AQ:$AQ,\"<=\"&EOMONTH($G29,0),'3.TTNV'!$AE:$AE,H$24)","v":0},{"$f":"COUNTIFS(INDIRECT('2. QT_LV'!$C$6),\"<>\"&\"Đã nghỉ việc\",INDIRECT('2. QT_LV'!$O$6),\"<=\"&$G29,INDIRECT('2. QT_LV'!$P$6),\">=\"&$G29,INDIRECT('2. QT_LV'!$W$6),\"Không\",INDIRECT('2. QT_LV'!$AA$6),I$24)\n+COUNTIFS(INDIRECT('2. QT_LV'!$C$6),\"Đã nghỉ việc\",INDIRECT('2. QT_LV'!$O$6),$G29,INDIRECT('2. QT_LV'!$AA$6),I$24)\n\n+COUNTIFS('2. QT_LV'!$O:$O,\">=\"&$G29,'2. QT_LV'!$O:$O,\"<=\"&EOMONTH($G29,0),'2. QT_LV'!$T:$T,\"Tăng mới\",'2. QT_LV'!$AA:$AA,I$24)\n\n-COUNTIFS('3.TTNV'!$AQ:$AQ,\">=\"&$G29,'3.TTNV'!$AQ:$AQ,\"<=\"&EOMONTH($G29,0),'3.TTNV'!$AE:$AE,I$24)","v":0},{"$f":"COUNTIFS(INDIRECT('2. QT_LV'!$C$6),\"<>\"&\"Đã nghỉ việc\",INDIRECT('2. QT_LV'!$O$6),\"<=\"&$G29,INDIRECT('2. QT_LV'!$P$6),\">=\"&$G29,INDIRECT('2. QT_LV'!$W$6),\"Không\",INDIRECT('2. QT_LV'!$AA$6),J$24)\n+COUNTIFS(INDIRECT('2. QT_LV'!$C$6),\"Đã nghỉ việc\",INDIRECT('2. QT_LV'!$O$6),$G29,INDIRECT('2. QT_LV'!$AA$6),J$24)\n\n+COUNTIFS('2. QT_LV'!$O:$O,\">=\"&$G29,'2. QT_LV'!$O:$O,\"<=\"&EOMONTH($G29,0),'2. QT_LV'!$T:$T,\"Tăng mới\",'2. QT_LV'!$AA:$AA,J$24)\n\n-COUNTIFS('3.TTNV'!$AQ:$AQ,\">=\"&$G29,'3.TTNV'!$AQ:$AQ,\"<=\"&EOMONTH($G29,0),'3.TTNV'!$AE:$AE,J$24)","v":0},{"$f":"COUNTIFS(INDIRECT('2. QT_LV'!$C$6),\"<>\"&\"Đã nghỉ việc\",INDIRECT('2. QT_LV'!$O$6),\"<=\"&$G29,INDIRECT('2. QT_LV'!$P$6),\">=\"&$G29,INDIRECT('2. QT_LV'!$W$6),\"Không\",INDIRECT('2. QT_LV'!$AA$6),K$24)\n+COUNTIFS(INDIRECT('2. QT_LV'!$C$6),\"Đã nghỉ việc\",INDIRECT('2. QT_LV'!$O$6),$G29,INDIRECT('2. QT_LV'!$AA$6),K$24)\n\n+COUNTIFS('2. QT_LV'!$O:$O,\">=\"&$G29,'2. QT_LV'!$O:$O,\"<=\"&EOMONTH($G29,0),'2. QT_LV'!$T:$T,\"Tăng mới\",'2. QT_LV'!$AA:$AA,K$24)\n\n-COUNTIFS('3.TTNV'!$AQ:$AQ,\">=\"&$G29,'3.TTNV'!$AQ:$AQ,\"<=\"&EOMONTH($G29,0),'3.TTNV'!$AE:$AE,K$24)","v":0},{"$f":"COUNTIFS(INDIRECT('2. QT_LV'!$C$6),\"<>\"&\"Đã nghỉ việc\",INDIRECT('2. QT_LV'!$O$6),\"<=\"&$G29,INDIRECT('2. QT_LV'!$P$6),\">=\"&$G29,INDIRECT('2. QT_LV'!$W$6),\"Không\",INDIRECT('2. QT_LV'!$AA$6),L$24)\n+COUNTIFS(INDIRECT('2. QT_LV'!$C$6),\"Đã nghỉ việc\",INDIRECT('2. QT_LV'!$O$6),$G29,INDIRECT('2. QT_LV'!$AA$6),L$24)\n\n+COUNTIFS('2. QT_LV'!$O:$O,\">=\"&$G29,'2. QT_LV'!$O:$O,\"<=\"&EOMONTH($G29,0),'2. QT_LV'!$T:$T,\"Tăng mới\",'2. QT_LV'!$AA:$AA,L$24)\n\n-COUNTIFS('3.TTNV'!$AQ:$AQ,\">=\"&$G29,'3.TTNV'!$AQ:$AQ,\"<=\"&EOMONTH($G29,0),'3.TTNV'!$AE:$AE,L$24)","v":0},0,null,{"$f":"DATE(RIGHT('5.Dashboard'!$M$67,4),A29,1)","v":"2020-05-01"},{"$f":"COUNTIFS(INDIRECT('2. QT_LV'!$C$6),\"<>\"&\"Đã nghỉ việc\",INDIRECT('2. QT_LV'!$O$6),\"<=\"&EOMONTH($O29,0),INDIRECT('2. QT_LV'!$P$6),\">=\"&$O29,INDIRECT('2. QT_LV'!$AB$6),P$24)","v":0},{"$f":"COUNTIFS(INDIRECT('2. QT_LV'!$C$6),\"<>\"&\"Đã nghỉ việc\",INDIRECT('2. QT_LV'!$O$6),\"<=\"&EOMONTH($O29,0),INDIRECT('2. QT_LV'!$P$6),\">=\"&$O29,INDIRECT('2. QT_LV'!$AB$6),Q$24)","v":0},0]
[6,{"$f":"DATE(RIGHT('5.Dashboard'!$M$67,4),A30,1)","v":"2020-06-01"},{"$f":"COUNTIFS(INDIRECT('2. QT_LV'!$C$6),\"<>\"&\"Đã nghỉ việc\",INDIRECT('2. QT_LV'!$O$6),\"<=\"&B30,INDIRECT('2. QT_LV'!$P$6),\">=\"&B30,INDIRECT('2. QT_LV'!$W$6),\"Không\",INDIRECT('2. QT_LV'!$Z$6),C$24)\n+COUNTIFS(INDIRECT('2. QT_LV'!$C$6),\"Đã nghỉ việc\",INDIRECT('2. QT_LV'!$O$6),B30,INDIRECT('2. QT_LV'!$Z$6),C$24)\n\n+COUNTIFS(INDIRECT('2. QT_LV'!$O$6),\">=\"&B30,INDIRECT('2. QT_LV'!$O$6),\"<=\"&EOMONTH(B30,0),INDIRECT('2. QT_LV'!$T$6),\"Tăng mới\",INDIRECT('2. QT_LV'!$Z$6),C$24)\n\n-COUNTIFS('3.TTNV'!$AQ:$AQ,\">=\"&B30,'3.TTNV'!$AQ:$AQ,\"<=\"&EOMONTH(B30,0),'3.TTNV'!$E:$E,C$24)","v":0},{"$f":"COUNTIFS(INDIRECT('2. QT_LV'!$C$6),\"<>\"&\"Đã nghỉ việc\",INDIRECT('2. QT_LV'!$O$6),\"<=\"&B30,INDIRECT('2. QT_LV'!$P$6),\">=\"&B30,INDIRECT('2. QT_LV'!$W$6),\"Không\",INDIRECT('2. QT_LV'!$Z$6),D$24)\n+COUNTIFS(INDIRECT('2. QT_LV'!$C$6),\"Đã nghỉ việc\",INDIRECT('2. QT_LV'!$O$6),B30,INDIRECT('2. QT_LV'!$Z$6),D$24)\n\n+COUNTIFS(INDIRECT('2. QT_LV'!$O$6),\">=\"&B30,INDIRECT('2. QT_LV'!$O$6),\"<=\"&EOMONTH(B30,0),INDIRECT('2. QT_LV'!$T$6),\"Tăng mới\",INDIRECT('2. QT_LV'!$Z$6),D$24)\n\n-COUNTIFS('3.TTNV'!$AQ:$AQ,\">=\"&B30,'3.TTNV'!$AQ:$AQ,\"<=\"&EOMONTH(B30,0),'3.TTNV'!$E:$E,D$24)","v":0},0,null,{"$f":"DATE(RIGHT('5.Dashboard'!$M$67,4),A30,1)","v":"2020-06-01"},{"$f":"COUNTIFS(INDIRECT('2. QT_LV'!$C$6),\"<>\"&\"Đã nghỉ việc\",INDIRECT('2. QT_LV'!$O$6),\"<=\"&$G30,INDIRECT('2. QT_LV'!$P$6),\">=\"&$G30,INDIRECT('2. QT_LV'!$W$6),\"Không\",INDIRECT('2. QT_LV'!$AA$6),H$24)\n+COUNTIFS(INDIRECT('2. QT_LV'!$C$6),\"Đã nghỉ việc\",INDIRECT('2. QT_LV'!$O$6),$G30,INDIRECT('2. QT_LV'!$AA$6),H$24)\n\n+COUNTIFS('2. QT_LV'!$O:$O,\">=\"&$G30,'2. QT_LV'!$O:$O,\"<=\"&EOMONTH($G30,0),'2. QT_LV'!$T:$T,\"Tăng mới\",'2. QT_LV'!$AA:$AA,H$24)\n\n-COUNTIFS('3.TTNV'!$AQ:$AQ,\">=\"&$G30,'3.TTNV'!$AQ:$AQ,\"<=\"&EOMONTH($G30,0),'3.TTNV'!$AE:$AE,H$24)","v":0},{"$f":"COUNTIFS(INDIRECT('2. QT_LV'!$C$6),\"<>\"&\"Đã nghỉ việc\",INDIRECT('2. QT_LV'!$O$6),\"<=\"&$G30,INDIRECT('2. QT_LV'!$P$6),\">=\"&$G30,INDIRECT('2. QT_LV'!$W$6),\"Không\",INDIRECT('2. QT_LV'!$AA$6),I$24)\n+COUNTIFS(INDIRECT('2. QT_LV'!$C$6),\"Đã nghỉ việc\",INDIRECT('2. QT_LV'!$O$6),$G30,INDIRECT('2. QT_LV'!$AA$6),I$24)\n\n+COUNTIFS('2. QT_LV'!$O:$O,\">=\"&$G30,'2. QT_LV'!$O:$O,\"<=\"&EOMONTH($G30,0),'2. QT_LV'!$T:$T,\"Tăng mới\",'2. QT_LV'!$AA:$AA,I$24)\n\n-COUNTIFS('3.TTNV'!$AQ:$AQ,\">=\"&$G30,'3.TTNV'!$AQ:$AQ,\"<=\"&EOMONTH($G30,0),'3.TTNV'!$AE:$AE,I$24)","v":0},{"$f":"COUNTIFS(INDIRECT('2. QT_LV'!$C$6),\"<>\"&\"Đã nghỉ việc\",INDIRECT('2. QT_LV'!$O$6),\"<=\"&$G30,INDIRECT('2. QT_LV'!$P$6),\">=\"&$G30,INDIRECT('2. QT_LV'!$W$6),\"Không\",INDIRECT('2. QT_LV'!$AA$6),J$24)\n+COUNTIFS(INDIRECT('2. QT_LV'!$C$6),\"Đã nghỉ việc\",INDIRECT('2. QT_LV'!$O$6),$G30,INDIRECT('2. QT_LV'!$AA$6),J$24)\n\n+COUNTIFS('2. QT_LV'!$O:$O,\">=\"&$G30,'2. QT_LV'!$O:$O,\"<=\"&EOMONTH($G30,0),'2. QT_LV'!$T:$T,\"Tăng mới\",'2. QT_LV'!$AA:$AA,J$24)\n\n-COUNTIFS('3.TTNV'!$AQ:$AQ,\">=\"&$G30,'3.TTNV'!$AQ:$AQ,\"<=\"&EOMONTH($G30,0),'3.TTNV'!$AE:$AE,J$24)","v":0},{"$f":"COUNTIFS(INDIRECT('2. QT_LV'!$C$6),\"<>\"&\"Đã nghỉ việc\",INDIRECT('2. QT_LV'!$O$6),\"<=\"&$G30,INDIRECT('2. QT_LV'!$P$6),\">=\"&$G30,INDIRECT('2. QT_LV'!$W$6),\"Không\",INDIRECT('2. QT_LV'!$AA$6),K$24)\n+COUNTIFS(INDIRECT('2. QT_LV'!$C$6),\"Đã nghỉ việc\",INDIRECT('2. QT_LV'!$O$6),$G30,INDIRECT('2. QT_LV'!$AA$6),K$24)\n\n+COUNTIFS('2. QT_LV'!$O:$O,\">=\"&$G30,'2. QT_LV'!$O:$O,\"<=\"&EOMONTH($G30,0),'2. QT_LV'!$T:$T,\"Tăng mới\",'2. QT_LV'!$AA:$AA,K$24)\n\n-COUNTIFS('3.TTNV'!$AQ:$AQ,\">=\"&$G30,'3.TTNV'!$AQ:$AQ,\"<=\"&EOMONTH($G30,0),'3.TTNV'!$AE:$AE,K$24)","v":0},{"$f":"COUNTIFS(INDIRECT('2. QT_LV'!$C$6),\"<>\"&\"Đã nghỉ việc\",INDIRECT('2. QT_LV'!$O$6),\"<=\"&$G30,INDIRECT('2. QT_LV'!$P$6),\">=\"&$G30,INDIRECT('2. QT_LV'!$W$6),\"Không\",INDIRECT('2. QT_LV'!$AA$6),L$24)\n+COUNTIFS(INDIRECT('2. QT_LV'!$C$6),\"Đã nghỉ việc\",INDIRECT('2. QT_LV'!$O$6),$G30,INDIRECT('2. QT_LV'!$AA$6),L$24)\n\n+COUNTIFS('2. QT_LV'!$O:$O,\">=\"&$G30,'2. QT_LV'!$O:$O,\"<=\"&EOMONTH($G30,0),'2. QT_LV'!$T:$T,\"Tăng mới\",'2. QT_LV'!$AA:$AA,L$24)\n\n-COUNTIFS('3.TTNV'!$AQ:$AQ,\">=\"&$G30,'3.TTNV'!$AQ:$AQ,\"<=\"&EOMONTH($G30,0),'3.TTNV'!$AE:$AE,L$24)","v":0},0,null,{"$f":"DATE(RIGHT('5.Dashboard'!$M$67,4),A30,1)","v":"2020-06-01"},{"$f":"COUNTIFS(INDIRECT('2. QT_LV'!$C$6),\"<>\"&\"Đã nghỉ việc\",INDIRECT('2. QT_LV'!$O$6),\"<=\"&EOMONTH($O30,0),INDIRECT('2. QT_LV'!$P$6),\">=\"&$O30,INDIRECT('2. QT_LV'!$AB$6),P$24)","v":0},{"$f":"COUNTIFS(INDIRECT('2. QT_LV'!$C$6),\"<>\"&\"Đã nghỉ việc\",INDIRECT('2. QT_LV'!$O$6),\"<=\"&EOMONTH($O30,0),INDIRECT('2. QT_LV'!$P$6),\">=\"&$O30,INDIRECT('2. QT_LV'!$AB$6),Q$24)","v":0},0]
[7,{"$f":"DATE(RIGHT('5.Dashboard'!$M$67,4),A31,1)","v":"2020-07-01"},{"$f":"COUNTIFS(INDIRECT('2. QT_LV'!$C$6),\"<>\"&\"Đã nghỉ việc\",INDIRECT('2. QT_LV'!$O$6),\"<=\"&B31,INDIRECT('2. QT_LV'!$P$6),\">=\"&B31,INDIRECT('2. QT_LV'!$W$6),\"Không\",INDIRECT('2. QT_LV'!$Z$6),C$24)\n+COUNTIFS(INDIRECT('2. QT_LV'!$C$6),\"Đã nghỉ việc\",INDIRECT('2. QT_LV'!$O$6),B31,INDIRECT('2. QT_LV'!$Z$6),C$24)\n\n+COUNTIFS(INDIRECT('2. QT_LV'!$O$6),\">=\"&B31,INDIRECT('2. QT_LV'!$O$6),\"<=\"&EOMONTH(B31,0),INDIRECT('2. QT_LV'!$T$6),\"Tăng mới\",INDIRECT('2. QT_LV'!$Z$6),C$24)\n\n-COUNTIFS('3.TTNV'!$AQ:$AQ,\">=\"&B31,'3.TTNV'!$AQ:$AQ,\"<=\"&EOMONTH(B31,0),'3.TTNV'!$E:$E,C$24)","v":0},{"$f":"COUNTIFS(INDIRECT('2. QT_LV'!$C$6),\"<>\"&\"Đã nghỉ việc\",INDIRECT('2. QT_LV'!$O$6),\"<=\"&B31,INDIRECT('2. QT_LV'!$P$6),\">=\"&B31,INDIRECT('2. QT_LV'!$W$6),\"Không\",INDIRECT('2. QT_LV'!$Z$6),D$24)\n+COUNTIFS(INDIRECT('2. QT_LV'!$C$6),\"Đã nghỉ việc\",INDIRECT('2. QT_LV'!$O$6),B31,INDIRECT('2. QT_LV'!$Z$6),D$24)\n\n+COUNTIFS(INDIRECT('2. QT_LV'!$O$6),\">=\"&B31,INDIRECT('2. QT_LV'!$O$6),\"<=\"&EOMONTH(B31,0),INDIRECT('2. QT_LV'!$T$6),\"Tăng mới\",INDIRECT('2. QT_LV'!$Z$6),D$24)\n\n-COUNTIFS('3.TTNV'!$AQ:$AQ,\">=\"&B31,'3.TTNV'!$AQ:$AQ,\"<=\"&EOMONTH(B31,0),'3.TTNV'!$E:$E,D$24)","v":0},0,null,{"$f":"DATE(RIGHT('5.Dashboard'!$M$67,4),A31,1)","v":"2020-07-01"},{"$f":"COUNTIFS(INDIRECT('2. QT_LV'!$C$6),\"<>\"&\"Đã nghỉ việc\",INDIRECT('2. QT_LV'!$O$6),\"<=\"&$G31,INDIRECT('2. QT_LV'!$P$6),\">=\"&$G31,INDIRECT('2. QT_LV'!$W$6),\"Không\",INDIRECT('2. QT_LV'!$AA$6),H$24)\n+COUNTIFS(INDIRECT('2. QT_LV'!$C$6),\"Đã nghỉ việc\",INDIRECT('2. QT_LV'!$O$6),$G31,INDIRECT('2. QT_LV'!$AA$6),H$24)\n\n+COUNTIFS('2. QT_LV'!$O:$O,\">=\"&$G31,'2. QT_LV'!$O:$O,\"<=\"&EOMONTH($G31,0),'2. QT_LV'!$T:$T,\"Tăng mới\",'2. QT_LV'!$AA:$AA,H$24)\n\n-COUNTIFS('3.TTNV'!$AQ:$AQ,\">=\"&$G31,'3.TTNV'!$AQ:$AQ,\"<=\"&EOMONTH($G31,0),'3.TTNV'!$AE:$AE,H$24)","v":0},{"$f":"COUNTIFS(INDIRECT('2. QT_LV'!$C$6),\"<>\"&\"Đã nghỉ việc\",INDIRECT('2. QT_LV'!$O$6),\"<=\"&$G31,INDIRECT('2. QT_LV'!$P$6),\">=\"&$G31,INDIRECT('2. QT_LV'!$W$6),\"Không\",INDIRECT('2. QT_LV'!$AA$6),I$24)\n+COUNTIFS(INDIRECT('2. QT_LV'!$C$6),\"Đã nghỉ việc\",INDIRECT('2. QT_LV'!$O$6),$G31,INDIRECT('2. QT_LV'!$AA$6),I$24)\n\n+COUNTIFS('2. QT_LV'!$O:$O,\">=\"&$G31,'2. QT_LV'!$O:$O,\"<=\"&EOMONTH($G31,0),'2. QT_LV'!$T:$T,\"Tăng mới\",'2. QT_LV'!$AA:$AA,I$24)\n\n-COUNTIFS('3.TTNV'!$AQ:$AQ,\">=\"&$G31,'3.TTNV'!$AQ:$AQ,\"<=\"&EOMONTH($G31,0),'3.TTNV'!$AE:$AE,I$24)","v":0},{"$f":"COUNTIFS(INDIRECT('2. QT_LV'!$C$6),\"<>\"&\"Đã nghỉ việc\",INDIRECT('2. QT_LV'!$O$6),\"<=\"&$G31,INDIRECT('2. QT_LV'!$P$6),\">=\"&$G31,INDIRECT('2. QT_LV'!$W$6),\"Không\",INDIRECT('2. QT_LV'!$AA$6),J$24)\n+COUNTIFS(INDIRECT('2. QT_LV'!$C$6),\"Đã nghỉ việc\",INDIRECT('2. QT_LV'!$O$6),$G31,INDIRECT('2. QT_LV'!$AA$6),J$24)\n\n+COUNTIFS('2. QT_LV'!$O:$O,\">=\"&$G31,'2. QT_LV'!$O:$O,\"<=\"&EOMONTH($G31,0),'2. QT_LV'!$T:$T,\"Tăng mới\",'2. QT_LV'!$AA:$AA,J$24)\n\n-COUNTIFS('3.TTNV'!$AQ:$AQ,\">=\"&$G31,'3.TTNV'!$AQ:$AQ,\"<=\"&EOMONTH($G31,0),'3.TTNV'!$AE:$AE,J$24)","v":0},{"$f":"COUNTIFS(INDIRECT('2. QT_LV'!$C$6),\"<>\"&\"Đã nghỉ việc\",INDIRECT('2. QT_LV'!$O$6),\"<=\"&$G31,INDIRECT('2. QT_LV'!$P$6),\">=\"&$G31,INDIRECT('2. QT_LV'!$W$6),\"Không\",INDIRECT('2. QT_LV'!$AA$6),K$24)\n+COUNTIFS(INDIRECT('2. QT_LV'!$C$6),\"Đã nghỉ việc\",INDIRECT('2. QT_LV'!$O$6),$G31,INDIRECT('2. QT_LV'!$AA$6),K$24)\n\n+COUNTIFS('2. QT_LV'!$O:$O,\">=\"&$G31,'2. QT_LV'!$O:$O,\"<=\"&EOMONTH($G31,0),'2. QT_LV'!$T:$T,\"Tăng mới\",'2. QT_LV'!$AA:$AA,K$24)\n\n-COUNTIFS('3.TTNV'!$AQ:$AQ,\">=\"&$G31,'3.TTNV'!$AQ:$AQ,\"<=\"&EOMONTH($G31,0),'3.TTNV'!$AE:$AE,K$24)","v":0},{"$f":"COUNTIFS(INDIRECT('2. QT_LV'!$C$6),\"<>\"&\"Đã nghỉ việc\",INDIRECT('2. QT_LV'!$O$6),\"<=\"&$G31,INDIRECT('2. QT_LV'!$P$6),\">=\"&$G31,INDIRECT('2. QT_LV'!$W$6),\"Không\",INDIRECT('2. QT_LV'!$AA$6),L$24)\n+COUNTIFS(INDIRECT('2. QT_LV'!$C$6),\"Đã nghỉ việc\",INDIRECT('2. QT_LV'!$O$6),$G31,INDIRECT('2. QT_LV'!$AA$6),L$24)\n\n+COUNTIFS('2. QT_LV'!$O:$O,\">=\"&$G31,'2. QT_LV'!$O:$O,\"<=\"&EOMONTH($G31,0),'2. QT_LV'!$T:$T,\"Tăng mới\",'2. QT_LV'!$AA:$AA,L$24)\n\n-COUNTIFS('3.TTNV'!$AQ:$AQ,\">=\"&$G31,'3.TTNV'!$AQ:$AQ,\"<=\"&EOMONTH($G31,0),'3.TTNV'!$AE:$AE,L$24)","v":0},0,null,{"$f":"DATE(RIGHT('5.Dashboard'!$M$67,4),A31,1)","v":"2020-07-01"},{"$f":"COUNTIFS(INDIRECT('2. QT_LV'!$C$6),\"<>\"&\"Đã nghỉ việc\",INDIRECT('2. QT_LV'!$O$6),\"<=\"&EOMONTH($O31,0),INDIRECT('2. QT_LV'!$P$6),\">=\"&$O31,INDIRECT('2. QT_LV'!$AB$6),P$24)","v":0},{"$f":"COUNTIFS(INDIRECT('2. QT_LV'!$C$6),\"<>\"&\"Đã nghỉ việc\",INDIRECT('2. QT_LV'!$O$6),\"<=\"&EOMONTH($O31,0),INDIRECT('2. QT_LV'!$P$6),\">=\"&$O31,INDIRECT('2. QT_LV'!$AB$6),Q$24)","v":0},0]
[8,{"$f":"DATE(RIGHT('5.Dashboard'!$M$67,4),A32,1)","v":"2020-08-01"},{"$f":"COUNTIFS(INDIRECT('2. QT_LV'!$C$6),\"<>\"&\"Đã nghỉ việc\",INDIRECT('2. QT_LV'!$O$6),\"<=\"&B32,INDIRECT('2. QT_LV'!$P$6),\">=\"&B32,INDIRECT('2. QT_LV'!$W$6),\"Không\",INDIRECT('2. QT_LV'!$Z$6),C$24)\n+COUNTIFS(INDIRECT('2. QT_LV'!$C$6),\"Đã nghỉ việc\",INDIRECT('2. QT_LV'!$O$6),B32,INDIRECT('2. QT_LV'!$Z$6),C$24)\n\n+COUNTIFS(INDIRECT('2. QT_LV'!$O$6),\">=\"&B32,INDIRECT('2. QT_LV'!$O$6),\"<=\"&EOMONTH(B32,0),INDIRECT('2. QT_LV'!$T$6),\"Tăng mới\",INDIRECT('2. QT_LV'!$Z$6),C$24)\n\n-COUNTIFS('3.TTNV'!$AQ:$AQ,\">=\"&B32,'3.TTNV'!$AQ:$AQ,\"<=\"&EOMONTH(B32,0),'3.TTNV'!$E:$E,C$24)","v":0},{"$f":"COUNTIFS(INDIRECT('2. QT_LV'!$C$6),\"<>\"&\"Đã nghỉ việc\",INDIRECT('2. QT_LV'!$O$6),\"<=\"&B32,INDIRECT('2. QT_LV'!$P$6),\">=\"&B32,INDIRECT('2. QT_LV'!$W$6),\"Không\",INDIRECT('2. QT_LV'!$Z$6),D$24)\n+COUNTIFS(INDIRECT('2. QT_LV'!$C$6),\"Đã nghỉ việc\",INDIRECT('2. QT_LV'!$O$6),B32,INDIRECT('2. QT_LV'!$Z$6),D$24)\n\n+COUNTIFS(INDIRECT('2. QT_LV'!$O$6),\">=\"&B32,INDIRECT('2. QT_LV'!$O$6),\"<=\"&EOMONTH(B32,0),INDIRECT('2. QT_LV'!$T$6),\"Tăng mới\",INDIRECT('2. QT_LV'!$Z$6),D$24)\n\n-COUNTIFS('3.TTNV'!$AQ:$AQ,\">=\"&B32,'3.TTNV'!$AQ:$AQ,\"<=\"&EOMONTH(B32,0),'3.TTNV'!$E:$E,D$24)","v":0},0,null,{"$f":"DATE(RIGHT('5.Dashboard'!$M$67,4),A32,1)","v":"2020-08-01"},{"$f":"COUNTIFS(INDIRECT('2. QT_LV'!$C$6),\"<>\"&\"Đã nghỉ việc\",INDIRECT('2. QT_LV'!$O$6),\"<=\"&$G32,INDIRECT('2. QT_LV'!$P$6),\">=\"&$G32,INDIRECT('2. QT_LV'!$W$6),\"Không\",INDIRECT('2. QT_LV'!$AA$6),H$24)\n+COUNTIFS(INDIRECT('2. QT_LV'!$C$6),\"Đã nghỉ việc\",INDIRECT('2. QT_LV'!$O$6),$G32,INDIRECT('2. QT_LV'!$AA$6),H$24)\n\n+COUNTIFS('2. QT_LV'!$O:$O,\">=\"&$G32,'2. QT_LV'!$O:$O,\"<=\"&EOMONTH($G32,0),'2. QT_LV'!$T:$T,\"Tăng mới\",'2. QT_LV'!$AA:$AA,H$24)\n\n-COUNTIFS('3.TTNV'!$AQ:$AQ,\">=\"&$G32,'3.TTNV'!$AQ:$AQ,\"<=\"&EOMONTH($G32,0),'3.TTNV'!$AE:$AE,H$24)","v":0},{"$f":"COUNTIFS(INDIRECT('2. QT_LV'!$C$6),\"<>\"&\"Đã nghỉ việc\",INDIRECT('2. QT_LV'!$O$6),\"<=\"&$G32,INDIRECT('2. QT_LV'!$P$6),\">=\"&$G32,INDIRECT('2. QT_LV'!$W$6),\"Không\",INDIRECT('2. QT_LV'!$AA$6),I$24)\n+COUNTIFS(INDIRECT('2. QT_LV'!$C$6),\"Đã nghỉ việc\",INDIRECT('2. QT_LV'!$O$6),$G32,INDIRECT('2. QT_LV'!$AA$6),I$24)\n\n+COUNTIFS('2. QT_LV'!$O:$O,\">=\"&$G32,'2. QT_LV'!$O:$O,\"<=\"&EOMONTH($G32,0),'2. QT_LV'!$T:$T,\"Tăng mới\",'2. QT_LV'!$AA:$AA,I$24)\n\n-COUNTIFS('3.TTNV'!$AQ:$AQ,\">=\"&$G32,'3.TTNV'!$AQ:$AQ,\"<=\"&EOMONTH($G32,0),'3.TTNV'!$AE:$AE,I$24)","v":0},{"$f":"COUNTIFS(INDIRECT('2. QT_LV'!$C$6),\"<>\"&\"Đã nghỉ việc\",INDIRECT('2. QT_LV'!$O$6),\"<=\"&$G32,INDIRECT('2. QT_LV'!$P$6),\">=\"&$G32,INDIRECT('2. QT_LV'!$W$6),\"Không\",INDIRECT('2. QT_LV'!$AA$6),J$24)\n+COUNTIFS(INDIRECT('2. QT_LV'!$C$6),\"Đã nghỉ việc\",INDIRECT('2. QT_LV'!$O$6),$G32,INDIRECT('2. QT_LV'!$AA$6),J$24)\n\n+COUNTIFS('2. QT_LV'!$O:$O,\">=\"&$G32,'2. QT_LV'!$O:$O,\"<=\"&EOMONTH($G32,0),'2. QT_LV'!$T:$T,\"Tăng mới\",'2. QT_LV'!$AA:$AA,J$24)\n\n-COUNTIFS('3.TTNV'!$AQ:$AQ,\">=\"&$G32,'3.TTNV'!$AQ:$AQ,\"<=\"&EOMONTH($G32,0),'3.TTNV'!$AE:$AE,J$24)","v":0},{"$f":"COUNTIFS(INDIRECT('2. QT_LV'!$C$6),\"<>\"&\"Đã nghỉ việc\",INDIRECT('2. QT_LV'!$O$6),\"<=\"&$G32,INDIRECT('2. QT_LV'!$P$6),\">=\"&$G32,INDIRECT('2. QT_LV'!$W$6),\"Không\",INDIRECT('2. QT_LV'!$AA$6),K$24)\n+COUNTIFS(INDIRECT('2. QT_LV'!$C$6),\"Đã nghỉ việc\",INDIRECT('2. QT_LV'!$O$6),$G32,INDIRECT('2. QT_LV'!$AA$6),K$24)\n\n+COUNTIFS('2. QT_LV'!$O:$O,\">=\"&$G32,'2. QT_LV'!$O:$O,\"<=\"&EOMONTH($G32,0),'2. QT_LV'!$T:$T,\"Tăng mới\",'2. QT_LV'!$AA:$AA,K$24)\n\n-COUNTIFS('3.TTNV'!$AQ:$AQ,\">=\"&$G32,'3.TTNV'!$AQ:$AQ,\"<=\"&EOMONTH($G32,0),'3.TTNV'!$AE:$AE,K$24)","v":0},{"$f":"COUNTIFS(INDIRECT('2. QT_LV'!$C$6),\"<>\"&\"Đã nghỉ việc\",INDIRECT('2. QT_LV'!$O$6),\"<=\"&$G32,INDIRECT('2. QT_LV'!$P$6),\">=\"&$G32,INDIRECT('2. QT_LV'!$W$6),\"Không\",INDIRECT('2. QT_LV'!$AA$6),L$24)\n+COUNTIFS(INDIRECT('2. QT_LV'!$C$6),\"Đã nghỉ việc\",INDIRECT('2. QT_LV'!$O$6),$G32,INDIRECT('2. QT_LV'!$AA$6),L$24)\n\n+COUNTIFS('2. QT_LV'!$O:$O,\">=\"&$G32,'2. QT_LV'!$O:$O,\"<=\"&EOMONTH($G32,0),'2. QT_LV'!$T:$T,\"Tăng mới\",'2. QT_LV'!$AA:$AA,L$24)\n\n-COUNTIFS('3.TTNV'!$AQ:$AQ,\">=\"&$G32,'3.TTNV'!$AQ:$AQ,\"<=\"&EOMONTH($G32,0),'3.TTNV'!$AE:$AE,L$24)","v":0},0,null,{"$f":"DATE(RIGHT('5.Dashboard'!$M$67,4),A32,1)","v":"2020-08-01"},{"$f":"COUNTIFS(INDIRECT('2. QT_LV'!$C$6),\"<>\"&\"Đã nghỉ việc\",INDIRECT('2. QT_LV'!$O$6),\"<=\"&EOMONTH($O32,0),INDIRECT('2. QT_LV'!$P$6),\">=\"&$O32,INDIRECT('2. QT_LV'!$AB$6),P$24)","v":0},{"$f":"COUNTIFS(INDIRECT('2. QT_LV'!$C$6),\"<>\"&\"Đã nghỉ việc\",INDIRECT('2. QT_LV'!$O$6),\"<=\"&EOMONTH($O32,0),INDIRECT('2. QT_LV'!$P$6),\">=\"&$O32,INDIRECT('2. QT_LV'!$AB$6),Q$24)","v":0},0]
[9,{"$f":"DATE(RIGHT('5.Dashboard'!$M$67,4),A33,1)","v":"2020-09-01"},{"$f":"COUNTIFS(INDIRECT('2. QT_LV'!$C$6),\"<>\"&\"Đã nghỉ việc\",INDIRECT('2. QT_LV'!$O$6),\"<=\"&B33,INDIRECT('2. QT_LV'!$P$6),\">=\"&B33,INDIRECT('2. QT_LV'!$W$6),\"Không\",INDIRECT('2. QT_LV'!$Z$6),C$24)\n+COUNTIFS(INDIRECT('2. QT_LV'!$C$6),\"Đã nghỉ việc\",INDIRECT('2. QT_LV'!$O$6),B33,INDIRECT('2. QT_LV'!$Z$6),C$24)\n\n+COUNTIFS(INDIRECT('2. QT_LV'!$O$6),\">=\"&B33,INDIRECT('2. QT_LV'!$O$6),\"<=\"&EOMONTH(B33,0),INDIRECT('2. QT_LV'!$T$6),\"Tăng mới\",INDIRECT('2. QT_LV'!$Z$6),C$24)\n\n-COUNTIFS('3.TTNV'!$AQ:$AQ,\">=\"&B33,'3.TTNV'!$AQ:$AQ,\"<=\"&EOMONTH(B33,0),'3.TTNV'!$E:$E,C$24)","v":0},{"$f":"COUNTIFS(INDIRECT('2. QT_LV'!$C$6),\"<>\"&\"Đã nghỉ việc\",INDIRECT('2. QT_LV'!$O$6),\"<=\"&B33,INDIRECT('2. QT_LV'!$P$6),\">=\"&B33,INDIRECT('2. QT_LV'!$W$6),\"Không\",INDIRECT('2. QT_LV'!$Z$6),D$24)\n+COUNTIFS(INDIRECT('2. QT_LV'!$C$6),\"Đã nghỉ việc\",INDIRECT('2. QT_LV'!$O$6),B33,INDIRECT('2. QT_LV'!$Z$6),D$24)\n\n+COUNTIFS(INDIRECT('2. QT_LV'!$O$6),\">=\"&B33,INDIRECT('2. QT_LV'!$O$6),\"<=\"&EOMONTH(B33,0),INDIRECT('2. QT_LV'!$T$6),\"Tăng mới\",INDIRECT('2. QT_LV'!$Z$6),D$24)\n\n-COUNTIFS('3.TTNV'!$AQ:$AQ,\">=\"&B33,'3.TTNV'!$AQ:$AQ,\"<=\"&EOMONTH(B33,0),'3.TTNV'!$E:$E,D$24)","v":0},0,null,{"$f":"DATE(RIGHT('5.Dashboard'!$M$67,4),A33,1)","v":"2020-09-01"},{"$f":"COUNTIFS(INDIRECT('2. QT_LV'!$C$6),\"<>\"&\"Đã nghỉ việc\",INDIRECT('2. QT_LV'!$O$6),\"<=\"&$G33,INDIRECT('2. QT_LV'!$P$6),\">=\"&$G33,INDIRECT('2. QT_LV'!$W$6),\"Không\",INDIRECT('2. QT_LV'!$AA$6),H$24)\n+COUNTIFS(INDIRECT('2. QT_LV'!$C$6),\"Đã nghỉ việc\",INDIRECT('2. QT_LV'!$O$6),$G33,INDIRECT('2. QT_LV'!$AA$6),H$24)\n\n+COUNTIFS('2. QT_LV'!$O:$O,\">=\"&$G33,'2. QT_LV'!$O:$O,\"<=\"&EOMONTH($G33,0),'2. QT_LV'!$T:$T,\"Tăng mới\",'2. QT_LV'!$AA:$AA,H$24)\n\n-COUNTIFS('3.TTNV'!$AQ:$AQ,\">=\"&$G33,'3.TTNV'!$AQ:$AQ,\"<=\"&EOMONTH($G33,0),'3.TTNV'!$AE:$AE,H$24)","v":0},{"$f":"COUNTIFS(INDIRECT('2. QT_LV'!$C$6),\"<>\"&\"Đã nghỉ việc\",INDIRECT('2. QT_LV'!$O$6),\"<=\"&$G33,INDIRECT('2. QT_LV'!$P$6),\">=\"&$G33,INDIRECT('2. QT_LV'!$W$6),\"Không\",INDIRECT('2. QT_LV'!$AA$6),I$24)\n+COUNTIFS(INDIRECT('2. QT_LV'!$C$6),\"Đã nghỉ việc\",INDIRECT('2. QT_LV'!$O$6),$G33,INDIRECT('2. QT_LV'!$AA$6),I$24)\n\n+COUNTIFS('2. QT_LV'!$O:$O,\">=\"&$G33,'2. QT_LV'!$O:$O,\"<=\"&EOMONTH($G33,0),'2. QT_LV'!$T:$T,\"Tăng mới\",'2. QT_LV'!$AA:$AA,I$24)\n\n-COUNTIFS('3.TTNV'!$AQ:$AQ,\">=\"&$G33,'3.TTNV'!$AQ:$AQ,\"<=\"&EOMONTH($G33,0),'3.TTNV'!$AE:$AE,I$24)","v":0},{"$f":"COUNTIFS(INDIRECT('2. QT_LV'!$C$6),\"<>\"&\"Đã nghỉ việc\",INDIRECT('2. QT_LV'!$O$6),\"<=\"&$G33,INDIRECT('2. QT_LV'!$P$6),\">=\"&$G33,INDIRECT('2. QT_LV'!$W$6),\"Không\",INDIRECT('2. QT_LV'!$AA$6),J$24)\n+COUNTIFS(INDIRECT('2. QT_LV'!$C$6),\"Đã nghỉ việc\",INDIRECT('2. QT_LV'!$O$6),$G33,INDIRECT('2. QT_LV'!$AA$6),J$24)\n\n+COUNTIFS('2. QT_LV'!$O:$O,\">=\"&$G33,'2. QT_LV'!$O:$O,\"<=\"&EOMONTH($G33,0),'2. QT_LV'!$T:$T,\"Tăng mới\",'2. QT_LV'!$AA:$AA,J$24)\n\n-COUNTIFS('3.TTNV'!$AQ:$AQ,\">=\"&$G33,'3.TTNV'!$AQ:$AQ,\"<=\"&EOMONTH($G33,0),'3.TTNV'!$AE:$AE,J$24)","v":0},{"$f":"COUNTIFS(INDIRECT('2. QT_LV'!$C$6),\"<>\"&\"Đã nghỉ việc\",INDIRECT('2. QT_LV'!$O$6),\"<=\"&$G33,INDIRECT('2. QT_LV'!$P$6),\">=\"&$G33,INDIRECT('2. QT_LV'!$W$6),\"Không\",INDIRECT('2. QT_LV'!$AA$6),K$24)\n+COUNTIFS(INDIRECT('2. QT_LV'!$C$6),\"Đã nghỉ việc\",INDIRECT('2. QT_LV'!$O$6),$G33,INDIRECT('2. QT_LV'!$AA$6),K$24)\n\n+COUNTIFS('2. QT_LV'!$O:$O,\">=\"&$G33,'2. QT_LV'!$O:$O,\"<=\"&EOMONTH($G33,0),'2. QT_LV'!$T:$T,\"Tăng mới\",'2. QT_LV'!$AA:$AA,K$24)\n\n-COUNTIFS('3.TTNV'!$AQ:$AQ,\">=\"&$G33,'3.TTNV'!$AQ:$AQ,\"<=\"&EOMONTH($G33,0),'3.TTNV'!$AE:$AE,K$24)","v":0},{"$f":"COUNTIFS(INDIRECT('2. QT_LV'!$C$6),\"<>\"&\"Đã nghỉ việc\",INDIRECT('2. QT_LV'!$O$6),\"<=\"&$G33,INDIRECT('2. QT_LV'!$P$6),\">=\"&$G33,INDIRECT('2. QT_LV'!$W$6),\"Không\",INDIRECT('2. QT_LV'!$AA$6),L$24)\n+COUNTIFS(INDIRECT('2. QT_LV'!$C$6),\"Đã nghỉ việc\",INDIRECT('2. QT_LV'!$O$6),$G33,INDIRECT('2. QT_LV'!$AA$6),L$24)\n\n+COUNTIFS('2. QT_LV'!$O:$O,\">=\"&$G33,'2. QT_LV'!$O:$O,\"<=\"&EOMONTH($G33,0),'2. QT_LV'!$T:$T,\"Tăng mới\",'2. QT_LV'!$AA:$AA,L$24)\n\n-COUNTIFS('3.TTNV'!$AQ:$AQ,\">=\"&$G33,'3.TTNV'!$AQ:$AQ,\"<=\"&EOMONTH($G33,0),'3.TTNV'!$AE:$AE,L$24)","v":0},0,null,{"$f":"DATE(RIGHT('5.Dashboard'!$M$67,4),A33,1)","v":"2020-09-01"},{"$f":"COUNTIFS(INDIRECT('2. QT_LV'!$C$6),\"<>\"&\"Đã nghỉ việc\",INDIRECT('2. QT_LV'!$O$6),\"<=\"&EOMONTH($O33,0),INDIRECT('2. QT_LV'!$P$6),\">=\"&$O33,INDIRECT('2. QT_LV'!$AB$6),P$24)","v":0},{"$f":"COUNTIFS(INDIRECT('2. QT_LV'!$C$6),\"<>\"&\"Đã nghỉ việc\",INDIRECT('2. QT_LV'!$O$6),\"<=\"&EOMONTH($O33,0),INDIRECT('2. QT_LV'!$P$6),\">=\"&$O33,INDIRECT('2. QT_LV'!$AB$6),Q$24)","v":0},0]
[10,{"$f":"DATE(RIGHT('5.Dashboard'!$M$67,4),A34,1)","v":"2020-10-01"},{"$f":"COUNTIFS(INDIRECT('2. QT_LV'!$C$6),\"<>\"&\"Đã nghỉ việc\",INDIRECT('2. QT_LV'!$O$6),\"<=\"&B34,INDIRECT('2. QT_LV'!$P$6),\">=\"&B34,INDIRECT('2. QT_LV'!$W$6),\"Không\",INDIRECT('2. QT_LV'!$Z$6),C$24)\n+COUNTIFS(INDIRECT('2. QT_LV'!$C$6),\"Đã nghỉ việc\",INDIRECT('2. QT_LV'!$O$6),B34,INDIRECT('2. QT_LV'!$Z$6),C$24)\n\n+COUNTIFS(INDIRECT('2. QT_LV'!$O$6),\">=\"&B34,INDIRECT('2. QT_LV'!$O$6),\"<=\"&EOMONTH(B34,0),INDIRECT('2. QT_LV'!$T$6),\"Tăng mới\",INDIRECT('2. QT_LV'!$Z$6),C$24)\n\n-COUNTIFS('3.TTNV'!$AQ:$AQ,\">=\"&B34,'3.TTNV'!$AQ:$AQ,\"<=\"&EOMONTH(B34,0),'3.TTNV'!$E:$E,C$24)","v":0},{"$f":"COUNTIFS(INDIRECT('2. QT_LV'!$C$6),\"<>\"&\"Đã nghỉ việc\",INDIRECT('2. QT_LV'!$O$6),\"<=\"&B34,INDIRECT('2. QT_LV'!$P$6),\">=\"&B34,INDIRECT('2. QT_LV'!$W$6),\"Không\",INDIRECT('2. QT_LV'!$Z$6),D$24)\n+COUNTIFS(INDIRECT('2. QT_LV'!$C$6),\"Đã nghỉ việc\",INDIRECT('2. QT_LV'!$O$6),B34,INDIRECT('2. QT_LV'!$Z$6),D$24)\n\n+COUNTIFS(INDIRECT('2. QT_LV'!$O$6),\">=\"&B34,INDIRECT('2. QT_LV'!$O$6),\"<=\"&EOMONTH(B34,0),INDIRECT('2. QT_LV'!$T$6),\"Tăng mới\",INDIRECT('2. QT_LV'!$Z$6),D$24)\n\n-COUNTIFS('3.TTNV'!$AQ:$AQ,\">=\"&B34,'3.TTNV'!$AQ:$AQ,\"<=\"&EOMONTH(B34,0),'3.TTNV'!$E:$E,D$24)","v":0},0,null,{"$f":"DATE(RIGHT('5.Dashboard'!$M$67,4),A34,1)","v":"2020-10-01"},{"$f":"COUNTIFS(INDIRECT('2. QT_LV'!$C$6),\"<>\"&\"Đã nghỉ việc\",INDIRECT('2. QT_LV'!$O$6),\"<=\"&$G34,INDIRECT('2. QT_LV'!$P$6),\">=\"&$G34,INDIRECT('2. QT_LV'!$W$6),\"Không\",INDIRECT('2. QT_LV'!$AA$6),H$24)\n+COUNTIFS(INDIRECT('2. QT_LV'!$C$6),\"Đã nghỉ việc\",INDIRECT('2. QT_LV'!$O$6),$G34,INDIRECT('2. QT_LV'!$AA$6),H$24)\n\n+COUNTIFS('2. QT_LV'!$O:$O,\">=\"&$G34,'2. QT_LV'!$O:$O,\"<=\"&EOMONTH($G34,0),'2. QT_LV'!$T:$T,\"Tăng mới\",'2. QT_LV'!$AA:$AA,H$24)\n\n-COUNTIFS('3.TTNV'!$AQ:$AQ,\">=\"&$G34,'3.TTNV'!$AQ:$AQ,\"<=\"&EOMONTH($G34,0),'3.TTNV'!$AE:$AE,H$24)","v":0},{"$f":"COUNTIFS(INDIRECT('2. QT_LV'!$C$6),\"<>\"&\"Đã nghỉ việc\",INDIRECT('2. QT_LV'!$O$6),\"<=\"&$G34,INDIRECT('2. QT_LV'!$P$6),\">=\"&$G34,INDIRECT('2. QT_LV'!$W$6),\"Không\",INDIRECT('2. QT_LV'!$AA$6),I$24)\n+COUNTIFS(INDIRECT('2. QT_LV'!$C$6),\"Đã nghỉ việc\",INDIRECT('2. QT_LV'!$O$6),$G34,INDIRECT('2. QT_LV'!$AA$6),I$24)\n\n+COUNTIFS('2. QT_LV'!$O:$O,\">=\"&$G34,'2. QT_LV'!$O:$O,\"<=\"&EOMONTH($G34,0),'2. QT_LV'!$T:$T,\"Tăng mới\",'2. QT_LV'!$AA:$AA,I$24)\n\n-COUNTIFS('3.TTNV'!$AQ:$AQ,\">=\"&$G34,'3.TTNV'!$AQ:$AQ,\"<=\"&EOMONTH($G34,0),'3.TTNV'!$AE:$AE,I$24)","v":0},{"$f":"COUNTIFS(INDIRECT('2. QT_LV'!$C$6),\"<>\"&\"Đã nghỉ việc\",INDIRECT('2. QT_LV'!$O$6),\"<=\"&$G34,INDIRECT('2. QT_LV'!$P$6),\">=\"&$G34,INDIRECT('2. QT_LV'!$W$6),\"Không\",INDIRECT('2. QT_LV'!$AA$6),J$24)\n+COUNTIFS(INDIRECT('2. QT_LV'!$C$6),\"Đã nghỉ việc\",INDIRECT('2. QT_LV'!$O$6),$G34,INDIRECT('2. QT_LV'!$AA$6),J$24)\n\n+COUNTIFS('2. QT_LV'!$O:$O,\">=\"&$G34,'2. QT_LV'!$O:$O,\"<=\"&EOMONTH($G34,0),'2. QT_LV'!$T:$T,\"Tăng mới\",'2. QT_LV'!$AA:$AA,J$24)\n\n-COUNTIFS('3.TTNV'!$AQ:$AQ,\">=\"&$G34,'3.TTNV'!$AQ:$AQ,\"<=\"&EOMONTH($G34,0),'3.TTNV'!$AE:$AE,J$24)","v":0},{"$f":"COUNTIFS(INDIRECT('2. QT_LV'!$C$6),\"<>\"&\"Đã nghỉ việc\",INDIRECT('2. QT_LV'!$O$6),\"<=\"&$G34,INDIRECT('2. QT_LV'!$P$6),\">=\"&$G34,INDIRECT('2. QT_LV'!$W$6),\"Không\",INDIRECT('2. QT_LV'!$AA$6),K$24)\n+COUNTIFS(INDIRECT('2. QT_LV'!$C$6),\"Đã nghỉ việc\",INDIRECT('2. QT_LV'!$O$6),$G34,INDIRECT('2. QT_LV'!$AA$6),K$24)\n\n+COUNTIFS('2. QT_LV'!$O:$O,\">=\"&$G34,'2. QT_LV'!$O:$O,\"<=\"&EOMONTH($G34,0),'2. QT_LV'!$T:$T,\"Tăng mới\",'2. QT_LV'!$AA:$AA,K$24)\n\n-COUNTIFS('3.TTNV'!$AQ:$AQ,\">=\"&$G34,'3.TTNV'!$AQ:$AQ,\"<=\"&EOMONTH($G34,0),'3.TTNV'!$AE:$AE,K$24)","v":0},{"$f":"COUNTIFS(INDIRECT('2. QT_LV'!$C$6),\"<>\"&\"Đã nghỉ việc\",INDIRECT('2. QT_LV'!$O$6),\"<=\"&$G34,INDIRECT('2. QT_LV'!$P$6),\">=\"&$G34,INDIRECT('2. QT_LV'!$W$6),\"Không\",INDIRECT('2. QT_LV'!$AA$6),L$24)\n+COUNTIFS(INDIRECT('2. QT_LV'!$C$6),\"Đã nghỉ việc\",INDIRECT('2. QT_LV'!$O$6),$G34,INDIRECT('2. QT_LV'!$AA$6),L$24)\n\n+COUNTIFS('2. QT_LV'!$O:$O,\">=\"&$G34,'2. QT_LV'!$O:$O,\"<=\"&EOMONTH($G34,0),'2. QT_LV'!$T:$T,\"Tăng mới\",'2. QT_LV'!$AA:$AA,L$24)\n\n-COUNTIFS('3.TTNV'!$AQ:$AQ,\">=\"&$G34,'3.TTNV'!$AQ:$AQ,\"<=\"&EOMONTH($G34,0),'3.TTNV'!$AE:$AE,L$24)","v":0},0,null,{"$f":"DATE(RIGHT('5.Dashboard'!$M$67,4),A34,1)","v":"2020-10-01"},{"$f":"COUNTIFS(INDIRECT('2. QT_LV'!$C$6),\"<>\"&\"Đã nghỉ việc\",INDIRECT('2. QT_LV'!$O$6),\"<=\"&EOMONTH($O34,0),INDIRECT('2. QT_LV'!$P$6),\">=\"&$O34,INDIRECT('2. QT_LV'!$AB$6),P$24)","v":0},{"$f":"COUNTIFS(INDIRECT('2. QT_LV'!$C$6),\"<>\"&\"Đã nghỉ việc\",INDIRECT('2. QT_LV'!$O$6),\"<=\"&EOMONTH($O34,0),INDIRECT('2. QT_LV'!$P$6),\">=\"&$O34,INDIRECT('2. QT_LV'!$AB$6),Q$24)","v":0},0]
[11,{"$f":"DATE(RIGHT('5.Dashboard'!$M$67,4),A35,1)","v":"2020-11-01"},{"$f":"COUNTIFS(INDIRECT('2. QT_LV'!$C$6),\"<>\"&\"Đã nghỉ việc\",INDIRECT('2. QT_LV'!$O$6),\"<=\"&B35,INDIRECT('2. QT_LV'!$P$6),\">=\"&B35,INDIRECT('2. QT_LV'!$W$6),\"Không\",INDIRECT('2. QT_LV'!$Z$6),C$24)\n+COUNTIFS(INDIRECT('2. QT_LV'!$C$6),\"Đã nghỉ việc\",INDIRECT('2. QT_LV'!$O$6),B35,INDIRECT('2. QT_LV'!$Z$6),C$24)\n\n+COUNTIFS(INDIRECT('2. QT_LV'!$O$6),\">=\"&B35,INDIRECT('2. QT_LV'!$O$6),\"<=\"&EOMONTH(B35,0),INDIRECT('2. QT_LV'!$T$6),\"Tăng mới\",INDIRECT('2. QT_LV'!$Z$6),C$24)\n\n-COUNTIFS('3.TTNV'!$AQ:$AQ,\">=\"&B35,'3.TTNV'!$AQ:$AQ,\"<=\"&EOMONTH(B35,0),'3.TTNV'!$E:$E,C$24)","v":0},{"$f":"COUNTIFS(INDIRECT('2. QT_LV'!$C$6),\"<>\"&\"Đã nghỉ việc\",INDIRECT('2. QT_LV'!$O$6),\"<=\"&B35,INDIRECT('2. QT_LV'!$P$6),\">=\"&B35,INDIRECT('2. QT_LV'!$W$6),\"Không\",INDIRECT('2. QT_LV'!$Z$6),D$24)\n+COUNTIFS(INDIRECT('2. QT_LV'!$C$6),\"Đã nghỉ việc\",INDIRECT('2. QT_LV'!$O$6),B35,INDIRECT('2. QT_LV'!$Z$6),D$24)\n\n+COUNTIFS(INDIRECT('2. QT_LV'!$O$6),\">=\"&B35,INDIRECT('2. QT_LV'!$O$6),\"<=\"&EOMONTH(B35,0),INDIRECT('2. QT_LV'!$T$6),\"Tăng mới\",INDIRECT('2. QT_LV'!$Z$6),D$24)\n\n-COUNTIFS('3.TTNV'!$AQ:$AQ,\">=\"&B35,'3.TTNV'!$AQ:$AQ,\"<=\"&EOMONTH(B35,0),'3.TTNV'!$E:$E,D$24)","v":0},0,null,{"$f":"DATE(RIGHT('5.Dashboard'!$M$67,4),A35,1)","v":"2020-11-01"},{"$f":"COUNTIFS(INDIRECT('2. QT_LV'!$C$6),\"<>\"&\"Đã nghỉ việc\",INDIRECT('2. QT_LV'!$O$6),\"<=\"&$G35,INDIRECT('2. QT_LV'!$P$6),\">=\"&$G35,INDIRECT('2. QT_LV'!$W$6),\"Không\",INDIRECT('2. QT_LV'!$AA$6),H$24)\n+COUNTIFS(INDIRECT('2. QT_LV'!$C$6),\"Đã nghỉ việc\",INDIRECT('2. QT_LV'!$O$6),$G35,INDIRECT('2. QT_LV'!$AA$6),H$24)\n\n+COUNTIFS('2. QT_LV'!$O:$O,\">=\"&$G35,'2. QT_LV'!$O:$O,\"<=\"&EOMONTH($G35,0),'2. QT_LV'!$T:$T,\"Tăng mới\",'2. QT_LV'!$AA:$AA,H$24)\n\n-COUNTIFS('3.TTNV'!$AQ:$AQ,\">=\"&$G35,'3.TTNV'!$AQ:$AQ,\"<=\"&EOMONTH($G35,0),'3.TTNV'!$AE:$AE,H$24)","v":0},{"$f":"COUNTIFS(INDIRECT('2. QT_LV'!$C$6),\"<>\"&\"Đã nghỉ việc\",INDIRECT('2. QT_LV'!$O$6),\"<=\"&$G35,INDIRECT('2. QT_LV'!$P$6),\">=\"&$G35,INDIRECT('2. QT_LV'!$W$6),\"Không\",INDIRECT('2. QT_LV'!$AA$6),I$24)\n+COUNTIFS(INDIRECT('2. QT_LV'!$C$6),\"Đã nghỉ việc\",INDIRECT('2. QT_LV'!$O$6),$G35,INDIRECT('2. QT_LV'!$AA$6),I$24)\n\n+COUNTIFS('2. QT_LV'!$O:$O,\">=\"&$G35,'2. QT_LV'!$O:$O,\"<=\"&EOMONTH($G35,0),'2. QT_LV'!$T:$T,\"Tăng mới\",'2. QT_LV'!$AA:$AA,I$24)\n\n-COUNTIFS('3.TTNV'!$AQ:$AQ,\">=\"&$G35,'3.TTNV'!$AQ:$AQ,\"<=\"&EOMONTH($G35,0),'3.TTNV'!$AE:$AE,I$24)","v":0},{"$f":"COUNTIFS(INDIRECT('2. QT_LV'!$C$6),\"<>\"&\"Đã nghỉ việc\",INDIRECT('2. QT_LV'!$O$6),\"<=\"&$G35,INDIRECT('2. QT_LV'!$P$6),\">=\"&$G35,INDIRECT('2. QT_LV'!$W$6),\"Không\",INDIRECT('2. QT_LV'!$AA$6),J$24)\n+COUNTIFS(INDIRECT('2. QT_LV'!$C$6),\"Đã nghỉ việc\",INDIRECT('2. QT_LV'!$O$6),$G35,INDIRECT('2. QT_LV'!$AA$6),J$24)\n\n+COUNTIFS('2. QT_LV'!$O:$O,\">=\"&$G35,'2. QT_LV'!$O:$O,\"<=\"&EOMONTH($G35,0),'2. QT_LV'!$T:$T,\"Tăng mới\",'2. QT_LV'!$AA:$AA,J$24)\n\n-COUNTIFS('3.TTNV'!$AQ:$AQ,\">=\"&$G35,'3.TTNV'!$AQ:$AQ,\"<=\"&EOMONTH($G35,0),'3.TTNV'!$AE:$AE,J$24)","v":0},{"$f":"COUNTIFS(INDIRECT('2. QT_LV'!$C$6),\"<>\"&\"Đã nghỉ việc\",INDIRECT('2. QT_LV'!$O$6),\"<=\"&$G35,INDIRECT('2. QT_LV'!$P$6),\">=\"&$G35,INDIRECT('2. QT_LV'!$W$6),\"Không\",INDIRECT('2. QT_LV'!$AA$6),K$24)\n+COUNTIFS(INDIRECT('2. QT_LV'!$C$6),\"Đã nghỉ việc\",INDIRECT('2. QT_LV'!$O$6),$G35,INDIRECT('2. QT_LV'!$AA$6),K$24)\n\n+COUNTIFS('2. QT_LV'!$O:$O,\">=\"&$G35,'2. QT_LV'!$O:$O,\"<=\"&EOMONTH($G35,0),'2. QT_LV'!$T:$T,\"Tăng mới\",'2. QT_LV'!$AA:$AA,K$24)\n\n-COUNTIFS('3.TTNV'!$AQ:$AQ,\">=\"&$G35,'3.TTNV'!$AQ:$AQ,\"<=\"&EOMONTH($G35,0),'3.TTNV'!$AE:$AE,K$24)","v":0},{"$f":"COUNTIFS(INDIRECT('2. QT_LV'!$C$6),\"<>\"&\"Đã nghỉ việc\",INDIRECT('2. QT_LV'!$O$6),\"<=\"&$G35,INDIRECT('2. QT_LV'!$P$6),\">=\"&$G35,INDIRECT('2. QT_LV'!$W$6),\"Không\",INDIRECT('2. QT_LV'!$AA$6),L$24)\n+COUNTIFS(INDIRECT('2. QT_LV'!$C$6),\"Đã nghỉ việc\",INDIRECT('2. QT_LV'!$O$6),$G35,INDIRECT('2. QT_LV'!$AA$6),L$24)\n\n+COUNTIFS('2. QT_LV'!$O:$O,\">=\"&$G35,'2. QT_LV'!$O:$O,\"<=\"&EOMONTH($G35,0),'2. QT_LV'!$T:$T,\"Tăng mới\",'2. QT_LV'!$AA:$AA,L$24)\n\n-COUNTIFS('3.TTNV'!$AQ:$AQ,\">=\"&$G35,'3.TTNV'!$AQ:$AQ,\"<=\"&EOMONTH($G35,0),'3.TTNV'!$AE:$AE,L$24)","v":0},0,null,{"$f":"DATE(RIGHT('5.Dashboard'!$M$67,4),A35,1)","v":"2020-11-01"},{"$f":"COUNTIFS(INDIRECT('2. QT_LV'!$C$6),\"<>\"&\"Đã nghỉ việc\",INDIRECT('2. QT_LV'!$O$6),\"<=\"&EOMONTH($O35,0),INDIRECT('2. QT_LV'!$P$6),\">=\"&$O35,INDIRECT('2. QT_LV'!$AB$6),P$24)","v":0},{"$f":"COUNTIFS(INDIRECT('2. QT_LV'!$C$6),\"<>\"&\"Đã nghỉ việc\",INDIRECT('2. QT_LV'!$O$6),\"<=\"&EOMONTH($O35,0),INDIRECT('2. QT_LV'!$P$6),\">=\"&$O35,INDIRECT('2. QT_LV'!$AB$6),Q$24)","v":0},0]
[12,{"$f":"DATE(RIGHT('5.Dashboard'!$M$67,4),A36,1)","v":"2020-12-01"},{"$f":"COUNTIFS(INDIRECT('2. QT_LV'!$C$6),\"<>\"&\"Đã nghỉ việc\",INDIRECT('2. QT_LV'!$O$6),\"<=\"&B36,INDIRECT('2. QT_LV'!$P$6),\">=\"&B36,INDIRECT('2. QT_LV'!$W$6),\"Không\",INDIRECT('2. QT_LV'!$Z$6),C$24)\n+COUNTIFS(INDIRECT('2. QT_LV'!$C$6),\"Đã nghỉ việc\",INDIRECT('2. QT_LV'!$O$6),B36,INDIRECT('2. QT_LV'!$Z$6),C$24)\n\n+COUNTIFS(INDIRECT('2. QT_LV'!$O$6),\">=\"&B36,INDIRECT('2. QT_LV'!$O$6),\"<=\"&EOMONTH(B36,0),INDIRECT('2. QT_LV'!$T$6),\"Tăng mới\",INDIRECT('2. QT_LV'!$Z$6),C$24)\n\n-COUNTIFS('3.TTNV'!$AQ:$AQ,\">=\"&B36,'3.TTNV'!$AQ:$AQ,\"<=\"&EOMONTH(B36,0),'3.TTNV'!$E:$E,C$24)","v":0},{"$f":"COUNTIFS(INDIRECT('2. QT_LV'!$C$6),\"<>\"&\"Đã nghỉ việc\",INDIRECT('2. QT_LV'!$O$6),\"<=\"&B36,INDIRECT('2. QT_LV'!$P$6),\">=\"&B36,INDIRECT('2. QT_LV'!$W$6),\"Không\",INDIRECT('2. QT_LV'!$Z$6),D$24)\n+COUNTIFS(INDIRECT('2. QT_LV'!$C$6),\"Đã nghỉ việc\",INDIRECT('2. QT_LV'!$O$6),B36,INDIRECT('2. QT_LV'!$Z$6),D$24)\n\n+COUNTIFS(INDIRECT('2. QT_LV'!$O$6),\">=\"&B36,INDIRECT('2. QT_LV'!$O$6),\"<=\"&EOMONTH(B36,0),INDIRECT('2. QT_LV'!$T$6),\"Tăng mới\",INDIRECT('2. QT_LV'!$Z$6),D$24)\n\n-COUNTIFS('3.TTNV'!$AQ:$AQ,\">=\"&B36,'3.TTNV'!$AQ:$AQ,\"<=\"&EOMONTH(B36,0),'3.TTNV'!$E:$E,D$24)","v":0},0,null,{"$f":"DATE(RIGHT('5.Dashboard'!$M$67,4),A36,1)","v":"2020-12-01"},{"$f":"COUNTIFS(INDIRECT('2. QT_LV'!$C$6),\"<>\"&\"Đã nghỉ việc\",INDIRECT('2. QT_LV'!$O$6),\"<=\"&$G36,INDIRECT('2. QT_LV'!$P$6),\">=\"&$G36,INDIRECT('2. QT_LV'!$W$6),\"Không\",INDIRECT('2. QT_LV'!$AA$6),H$24)\n+COUNTIFS(INDIRECT('2. QT_LV'!$C$6),\"Đã nghỉ việc\",INDIRECT('2. QT_LV'!$O$6),$G36,INDIRECT('2. QT_LV'!$AA$6),H$24)\n\n+COUNTIFS('2. QT_LV'!$O:$O,\">=\"&$G36,'2. QT_LV'!$O:$O,\"<=\"&EOMONTH($G36,0),'2. QT_LV'!$T:$T,\"Tăng mới\",'2. QT_LV'!$AA:$AA,H$24)\n\n-COUNTIFS('3.TTNV'!$AQ:$AQ,\">=\"&$G36,'3.TTNV'!$AQ:$AQ,\"<=\"&EOMONTH($G36,0),'3.TTNV'!$AE:$AE,H$24)","v":0},{"$f":"COUNTIFS(INDIRECT('2. QT_LV'!$C$6),\"<>\"&\"Đã nghỉ việc\",INDIRECT('2. QT_LV'!$O$6),\"<=\"&$G36,INDIRECT('2. QT_LV'!$P$6),\">=\"&$G36,INDIRECT('2. QT_LV'!$W$6),\"Không\",INDIRECT('2. QT_LV'!$AA$6),I$24)\n+COUNTIFS(INDIRECT('2. QT_LV'!$C$6),\"Đã nghỉ việc\",INDIRECT('2. QT_LV'!$O$6),$G36,INDIRECT('2. QT_LV'!$AA$6),I$24)\n\n+COUNTIFS('2. QT_LV'!$O:$O,\">=\"&$G36,'2. QT_LV'!$O:$O,\"<=\"&EOMONTH($G36,0),'2. QT_LV'!$T:$T,\"Tăng mới\",'2. QT_LV'!$AA:$AA,I$24)\n\n-COUNTIFS('3.TTNV'!$AQ:$AQ,\">=\"&$G36,'3.TTNV'!$AQ:$AQ,\"<=\"&EOMONTH($G36,0),'3.TTNV'!$AE:$AE,I$24)","v":0},{"$f":"COUNTIFS(INDIRECT('2. QT_LV'!$C$6),\"<>\"&\"Đã nghỉ việc\",INDIRECT('2. QT_LV'!$O$6),\"<=\"&$G36,INDIRECT('2. QT_LV'!$P$6),\">=\"&$G36,INDIRECT('2. QT_LV'!$W$6),\"Không\",INDIRECT('2. QT_LV'!$AA$6),J$24)\n+COUNTIFS(INDIRECT('2. QT_LV'!$C$6),\"Đã nghỉ việc\",INDIRECT('2. QT_LV'!$O$6),$G36,INDIRECT('2. QT_LV'!$AA$6),J$24)\n\n+COUNTIFS('2. QT_LV'!$O:$O,\">=\"&$G36,'2. QT_LV'!$O:$O,\"<=\"&EOMONTH($G36,0),'2. QT_LV'!$T:$T,\"Tăng mới\",'2. QT_LV'!$AA:$AA,J$24)\n\n-COUNTIFS('3.TTNV'!$AQ:$AQ,\">=\"&$G36,'3.TTNV'!$AQ:$AQ,\"<=\"&EOMONTH($G36,0),'3.TTNV'!$AE:$AE,J$24)","v":0},{"$f":"COUNTIFS(INDIRECT('2. QT_LV'!$C$6),\"<>\"&\"Đã nghỉ việc\",INDIRECT('2. QT_LV'!$O$6),\"<=\"&$G36,INDIRECT('2. QT_LV'!$P$6),\">=\"&$G36,INDIRECT('2. QT_LV'!$W$6),\"Không\",INDIRECT('2. QT_LV'!$AA$6),K$24)\n+COUNTIFS(INDIRECT('2. QT_LV'!$C$6),\"Đã nghỉ việc\",INDIRECT('2. QT_LV'!$O$6),$G36,INDIRECT('2. QT_LV'!$AA$6),K$24)\n\n+COUNTIFS('2. QT_LV'!$O:$O,\">=\"&$G36,'2. QT_LV'!$O:$O,\"<=\"&EOMONTH($G36,0),'2. QT_LV'!$T:$T,\"Tăng mới\",'2. QT_LV'!$AA:$AA,K$24)\n\n-COUNTIFS('3.TTNV'!$AQ:$AQ,\">=\"&$G36,'3.TTNV'!$AQ:$AQ,\"<=\"&EOMONTH($G36,0),'3.TTNV'!$AE:$AE,K$24)","v":0},{"$f":"COUNTIFS(INDIRECT('2. QT_LV'!$C$6),\"<>\"&\"Đã nghỉ việc\",INDIRECT('2. QT_LV'!$O$6),\"<=\"&$G36,INDIRECT('2. QT_LV'!$P$6),\">=\"&$G36,INDIRECT('2. QT_LV'!$W$6),\"Không\",INDIRECT('2. QT_LV'!$AA$6),L$24)\n+COUNTIFS(INDIRECT('2. QT_LV'!$C$6),\"Đã nghỉ việc\",INDIRECT('2. QT_LV'!$O$6),$G36,INDIRECT('2. QT_LV'!$AA$6),L$24)\n\n+COUNTIFS('2. QT_LV'!$O:$O,\">=\"&$G36,'2. QT_LV'!$O:$O,\"<=\"&EOMONTH($G36,0),'2. QT_LV'!$T:$T,\"Tăng mới\",'2. QT_LV'!$AA:$AA,L$24)\n\n-COUNTIFS('3.TTNV'!$AQ:$AQ,\">=\"&$G36,'3.TTNV'!$AQ:$AQ,\"<=\"&EOMONTH($G36,0),'3.TTNV'!$AE:$AE,L$24)","v":0},0,null,{"$f":"DATE(RIGHT('5.Dashboard'!$M$67,4),A36,1)","v":"2020-12-01"},{"$f":"COUNTIFS(INDIRECT('2. QT_LV'!$C$6),\"<>\"&\"Đã nghỉ việc\",INDIRECT('2. QT_LV'!$O$6),\"<=\"&EOMONTH($O36,0),INDIRECT('2. QT_LV'!$P$6),\">=\"&$O36,INDIRECT('2. QT_LV'!$AB$6),P$24)","v":0},{"$f":"COUNTIFS(INDIRECT('2. QT_LV'!$C$6),\"<>\"&\"Đã nghỉ việc\",INDIRECT('2. QT_LV'!$O$6),\"<=\"&EOMONTH($O36,0),INDIRECT('2. QT_LV'!$P$6),\">=\"&$O36,INDIRECT('2. QT_LV'!$AB$6),Q$24)","v":0},0]
["Tổng",null,{"$f":"AVERAGE(C25:C36)","v":0},0,0,null,"Tổng",{"$f":"SUM(H25:H36)","v":0},{"$f":"AVERAGE(I25:I36)","v":0},0,0,0,0,null,"Tổng",{"$f":"AVERAGE(P25:P36)","v":0},0,0]
[]
["Trung bình năm",null,null,"Tháng",null,null,"Trung bình năm",null,null,"Tháng",null,null,null,null,"Trung bình năm"]
["Nam",{"$f":"C37","v":0},null,"Nam",{"$f":"VLOOKUP('5.Dashboard'!$M$80,$B$25:$D$36,2,0)","v":0},null,"Sau đại học",{"$f":"H37","v":0},null,"Sau đại học",{"$f":"VLOOKUP('5.Dashboard'!$M$80,$G$25:$L$36,2,0)","v":0},null,null,null,"Độc thân",{"$f":"P37","v":0}]
["Nữ",{"$f":"D37","v":0},null,"Nữ",{"$f":"VLOOKUP('5.Dashboard'!$M$80,$B$25:$D$36,3,0)","v":0},null,"Đại học",{"$f":"I37","v":0},null,"Đại học",{"$f":"VLOOKUP('5.Dashboard'!$M$80,$G$25:$L$36,3,0)","v":0},null,null,null,"Đã kết hôn",{"$f":"Q37","v":0}]
[null,null,null,null,null,null,"Cao đẳng",{"$f":"J37","v":0},null,"Cao đẳng",{"$f":"VLOOKUP('5.Dashboard'!$M$80,$G$25:$L$36,4,0)","v":0},null,null,null,"Tháng"]
[null,null,null,null,null,null,"PTTH",{"$f":"K37","v":0},null,"PTTH",{"$f":"VLOOKUP('5.Dashboard'!$M$80,$G$25:$L$36,5,0)","v":0},null,null,null,"Độc thân",{"$f":"VLOOKUP('5.Dashboard'!$M$80,$O$25:$Q$36,2,0)","v":0}]
[null,null,null,null,null,null,"Chưa có TT",{"$f":"L37","v":0},null,"Chưa có TT",{"$f":"VLOOKUP('5.Dashboard'!$M$80,$G$25:$L$36,6,0)","v":0},null,null,null,"Đã kết hôn",{"$f":"VLOOKUP('5.Dashboard'!$M$80,$O$25:$Q$36,3,0)","v":0}]

{"sheet":"4.Report","index":4,"n_rows":24,"n_cols":47,"rows_kept":24,"cut":false,"hidden":false,"merged":[[14,11,14,12],[15,11,15,12],[16,11,16,12],[22,11,22,12],[23,11,23,12],[17,11,17,12],[18,11,18,12],[19,11,19,12],[20,11,20,12],[21,11,21,12],[9,11,9,12],[7,20,8,20],[7,21,8,21],[12,11,12,12],[13,11,13,12],[7,23,8,23],[7,24,8,24],[3,5,3,6],[3,9,3,10],[7,17,8,17],[7,18,8,18],[7,19,8,19],[7,11,8,12],[5,11,5,12],[20,26,20,27],[20,41,20,42],[7,1,8,1],[7,2,8,2],[7,3,8,3],[7,4,8,4],[7,5,8,5],[7,6,7,7],[7,8,8,8],[7,9,7,10],[7,13,8,13],[7,14,8,14],[7,15,8,15],[10,11,10,12],[11,11,11,12],[7,22,8,22]]}
[]
[null,"I. BÁO CÁO DANH SÁCH TĂNG GIẢM NHÂN SỰ THEO THÁNG",null,null,null,null,null,null,null,null,null,null,null,null,null,null,null,"II. BÁO CÁO TỶ LỆ NGHỈ VIỆC THEO GIAI ĐOẠN",null,null,null,null,null,null,null,null,"III. BÁO CÁO PHÂN TÍCH CƠ CẤU LAO ĐỘNG (Gồm cả những lao động đã làm việc/đã nghỉ việc trong tháng)"]
[]
[null,null,"Chọn năm","Năm2019",null,"Chọn ngày đầu kỳ",null,"2019-07-01",null,"Ngày cuối kỳ",null,{"$f":"EOMONTH(H4,0)","v":"2019-07-31"}]
[]
[null,"Điền","CT","CT","CT","CT","CT","CT","CT","CT","CT","CT",null,"CT","CT","CT"]
[null,null,null,null,null,{"$f":"SUBTOTAL(9,F10:F35)","v":0},{"$f":"SUBTOTAL(9,G10:G35)","v":0},{"$f":"SUBTOTAL(9,H10:H35)","v":0},null,{"$f":"SUBTOTAL(9,J10:J35)","v":0},{"$f":"SUBTOTAL(9,K10:K34)","v":0},null,null,{"$f":"SUBTOTAL(9,N10:N35)","v":0},{"$f":"SUBTOTAL(9,O10:O35)","v":0},{"$f":"SUBTOTAL(9,P10:P35)","v":0},null,null,null,null,null,null,null,null,null,null,null,null,null,null,"1. Phân theo giới tính",null,null,null,null,null,null,null,null,"2. Phân theo trình độ",null,null,null,null,null,null,"3. Phân theo tình trạng hôn nhân"]
[null,"STT","Phòng","Bộ phận","Nhóm","Tổng số NS ngày đầu kỳ","Số lượng nhân sự tăng trong tháng",null,"Dánh sách nhân sự \"TĂNG MỚI\" và thời điểm tăng","Số lượng nhân sự giảm trong tháng",null,"Danh sách nhân sự \"NGHỈ VIỆC\" và thời điểm nghỉ",null,"Tổng số NS tới ngày cuối kỳ","Nghỉ TS, nghỉ KL dài ngày","Tổng số NS ĐANG LÀM VIỆC tới ngày cuối kỳ",null,"STT","Tháng","Số lượng nhân sự đầu tháng","Số lượng nhân sự tăng mới","Số lượng nhân sự nghỉ việc","Số lượng nhân sự cuối tháng","Tỷ lệ nhân sự tuyển dụng mới","Tỷ lệ nghỉ việc",null,"STT","Tháng","Nam","Nữ","Tổng",null,"Tháng","Sau đại học","Đại học","Cao đẳng","PTTH","Trung cấp","Chưa có TT","Tổng",null,"STT","Tháng","Độc thân","Đã kết hôn","Đã ly hôn","Tổng"]
[null,null,null,null,null,null,"Tăng mới","Thay đổi CD, ĐV",null,"Nghỉ việc","Thay đổi CD, ĐV",null,null,null,null,null,null,null,null,null,null,null,null,null,null,null,1,{"$f":"DATE(RIGHT('5.Dashboard'!$F$4,4),AA9,1)","v":"2020-01-01"},{"$f":"COUNTIFS('2. QT_LV'!$C:$C,\"<>\"&\"Đã nghỉ việc\",'2. QT_LV'!$O:$O,\"<=\"&EOMONTH($AB9,0),'2. QT_LV'!$P:$P,\">=\"&$AB9,'2. QT_LV'!$Z:$Z,AC$8)","v":0},{"$f":"COUNTIFS('2. QT_LV'!$C:$C,\"<>\"&\"Đã nghỉ việc\",'2. QT_LV'!$O:$O,\"<=\"&EOMONTH($AB9,0),'2. QT_LV'!$P:$P,\">=\"&$AB9,'2. QT_LV'!$Z:$Z,AD$8)","v":0},{"$f":"SUM(AC9:AD9)","v":0},null,{"$f":"DATE(RIGHT('5.Dashboard'!$F$4,4),AA9,1)","v":"2020-01-01"},{"$f":"COUNTIFS('2. QT_LV'!$C:$C,\"<>\"&\"Đã nghỉ việc\",'2. QT_LV'!$O:$O,\"<=\"&EOMONTH($AG9,0),'2. QT_LV'!$P:$P,\">=\"&$AG9,'2. QT_LV'!$AA:$AA,AH$8)","v":0},{"$f":"COUNTIFS('2. QT_LV'!$C:$C,\"<>\"&\"Đã nghỉ việc\",'2. QT_LV'!$O:$O,\"<=\"&EOMONTH($AG9,0),'2. QT_LV'!$P:$P,\">=\"&$AG9,'2. QT_LV'!$AA:$AA,AI$8)","v":0},{"$f":"COUNTIFS('2. QT_LV'!$C:$C,\"<>\"&\"Đã nghỉ việc\",'2. QT_LV'!$O:$O,\"<=\"&EOMONTH($AG9,0),'2. QT_LV'!$P:$P,\">=\"&$AG9,'2. QT_LV'!$AA:$AA,AJ$8)","v":0},{"$f":"COUNTIFS('2. QT_LV'!$C:$C,\"<>\"&\"Đã nghỉ việc\",'2. QT_LV'!$O:$O,\"<=\"&EOMONTH($AG9,0),'2. QT_LV'!$P:$P,\">=\"&$AG9,'2. QT_LV'!$AA:$AA,AK$8)","v":0},{"$f":"COUNTIFS('2. QT_LV'!$C:$C,\"<>\"&\"Đã nghỉ việc\",'2. QT_LV'!$O:$O,\"<=\"&EOMONTH($AG9,0),'2. QT_LV'!$P:$P,\">=\"&$AG9,'2. QT_LV'!$AA:$AA,AL$8)","v":0},{"$f":"COUNTIFS('2. QT_LV'!$C:$C,\"<>\"&\"Đã nghỉ việc\",'2. QT_LV'!$O:$O,\"<=\"&EOMONTH($AG9,0),'2. QT_LV'!$P:$P,\">=\"&$AG9,'2. QT_LV'!$AA:$AA,AM$8)","v":0},{"$f":"SUM(AH9:AM9)","v":0},null,1,{"$f":"DATE(IF('5.Dashboard'!$F$4=\"Năm2019\",2019,IF('5.Dashboard'!$F$4=\"Năm2020\",2020)),AP9,1)","v":"2020-01-01"},{"$f":"COUNTIFS('2. QT_LV'!$C:$C,\"<>\"&\"Đã nghỉ việc\",'2. QT_LV'!$O:$O,\"<=\"&EOMONTH($AQ9,0),'2. QT_LV'!$P:$P,\">=\"&$AQ9,'2. QT_LV'!$AB:$AB,AR$8)","v":0},{"$f":"COUNTIFS('2. QT_LV'!$C:$C,\"<>\"&\"Đã nghỉ việc\",'2. QT_LV'!$O:$O,\"<=\"&EOMONTH($AQ9,0),'2. QT_LV'!$P:$P,\">=\"&$AQ9,'2. QT_LV'!$AB:$AB,AS$8)","v":0},{"$f":"COUNTIFS('2. QT_LV'!$C:$C,\"<>\"&\"Đã nghỉ việc\",'2. QT_LV'!$O:$O,\"<=\"&EOMONTH($AQ9,0),'2. QT_LV'!$P:$P,\">=\"&$AQ9,'2. QT_LV'!$AB:$AB,AT$8)","v":0},{"$f":"SUM(AR9:AT9)","v":0}]
[null,{"$f":"ROW()-ROW($B$9)","v":1},{"$f":"'1. QT_ĐV'!V10","v":"01. Ban giám đốc"},{"$f":"'1. QT_ĐV'!W10","v":"0"},{"$f":"'1. QT_ĐV'!X10","v":"0"},{"$f":"COUNTIFS('2. QT_LV'!K:K,C10,'2. QT_LV'!L:L,D10,'2. QT_LV'!M:M,E10,'2. QT_LV'!D:D,\"ON\",'2. QT_LV'!C:C,\"<>\"&\"Đã nghỉ việc\",'2. QT_LV'!V:V,\"<>\"&$H$4&\"Thay đổi đơn vị\",'2. QT_LV'!V:V,\"<>\"&$H$4&\"Thay đổi chức danh\",'2. QT_LV'!W:W,\"<>\"&\"Có\")\n+COUNTIFS('2. QT_LV'!K:K,C10,'2. QT_LV'!L:L,D10,'2. QT_LV'!M:M,E10,'2. QT_LV'!G:G,\"ON\",'2. QT_LV'!T:T,\"Thay đổi chức danh\",'2. QT_LV'!O:O,\"=\"&$H$4)\n+COUNTIFS('2. QT_LV'!K:K,C10,'2. QT_LV'!L:L,D10,'2. QT_LV'!M:M,E10,'2. QT_LV'!G:G,\"ON\",'2. QT_LV'!T:T,\"Thay đổi đơn vị\",'2. QT_LV'!O:O,\"=\"&$H$4)\n+COUNTIFS('2. QT_LV'!K:K,C10,'2. QT_LV'!L:L,D10,'2. QT_LV'!M:M,E10,'2. QT_LV'!D:D,\"ON\",'2. QT_LV'!U:U,\"Nghỉ việc\",'2. QT_LV'!O:O,$H$4)","v":0},{"$f":"COUNTIFS('2. QT_LV'!K:K,C10,'2. QT_LV'!L:L,D10,'2. QT_LV'!M:M,E10,'2. QT_LV'!G:G,\"ON\",'2. QT_LV'!T:T,\"Tăng mới\",'2. QT_LV'!O:O,\">=\"&$H$4)","v":0},{"$f":"COUNTIFS('2. QT_LV'!K:K,C10,'2. QT_LV'!L:L,D10,'2. QT_LV'!M:M,E10,'2. QT_LV'!G:G,\"ON\",'2. QT_LV'!T:T,\"Thay đổi chức danh\",'2. QT_LV'!O:O,\">\"&$H$4)\n+COUNTIFS('2. QT_LV'!K:K,C10,'2. QT_LV'!L:L,D10,'2. QT_LV'!M:M,E10,'2. QT_LV'!G:G,\"ON\",'2. QT_LV'!T:T,\"Thay đổi đơn vị\",'2. QT_LV'!O:O,\">\"&$H$4)","v":0},{"$f":"(_xlfn.TEXTJOIN(\"\n\",TRUE,IF(\n(INDIRECT('2. QT_LV'!$K$6)=C10)*\n(INDIRECT('2. QT_LV'!$L$6)=D10)*\n(INDIRECT('2. QT_LV'!$M$6)=E10)*\n(INDIRECT('2. QT_LV'!$G$6)=\"ON\")*\n(INDIRECT('2. QT_LV'!$T$6)=\"Tăng mới\")*\n(INDIRECT('2. QT_LV'!$O$6)>=$H$4)=1,\nINDIRECT('2. QT_LV'!$I$6)&\" \"&INDIRECT('2. QT_LV'!$Q$6),\"\")))","v":""},{"$f":"COUNTIFS('2. QT_LV'!K:K,C10,'2. QT_LV'!L:L,D10,'2. QT_LV'!M:M,E10,'2. QT_LV'!G:G,\"ON\",'2. QT_LV'!U:U,\"Nghỉ việc\",'2. QT_LV'!O:O,\">=\"&$H$4)","v":0},{"$f":"COUNTIFS('2. QT_LV'!K:K,C10,'2. QT_LV'!L:L,D10,'2. QT_LV'!M:M,E10,'2. QT_LV'!G:G,\"ON\",'2. QT_LV'!X:X,\"Có\")","v":0},{"$f":"(_xlfn.TEXTJOIN(\"\n\",TRUE,IF(\n(INDIRECT('2. QT_LV'!$K$6)=C10)*\n(INDIRECT('2. QT_LV'!$L$6)=D10)*\n(INDIRECT('2. QT_LV'!$M$6)=E10)*\n(INDIRECT('2. QT_LV'!$G$6)=\"ON\")*\n(INDIRECT('2. QT_LV'!$U$6)=\"Nghỉ việc\")*\n(INDIRECT('2. QT_LV'!$O$6)>=$H$4)=1,\nINDIRECT('2. QT_LV'!$I$6)&\" \"&INDIRECT('2. QT_LV'!$Q$6),\"\")))","v":""},null,{"$f":"COUNTIFS('2. QT_LV'!K:K,C10,'2. QT_LV'!L:L,D10,'2. QT_LV'!M:M,E10,'2. QT_LV'!E:E,\"ON\",'2. QT_LV'!C:C,\"<>\"&\"Đã nghỉ việc\")","v":0},{"$f":"COUNTIFS(INDIRECT('2. QT_LV'!$K$6),C10,INDIRECT('2. QT_LV'!$L$6),D10,INDIRECT('2. QT_LV'!$M$6),E10,INDIRECT('2. QT_LV'!$G$6),\"ON\",INDIRECT('2. QT_LV'!$C$6),\"Thai sản\")\n+COUNTIFS(INDIRECT('2. QT_LV'!$K$6),C10,INDIRECT('2. QT_LV'!$L$6),D10,INDIRECT('2. QT_LV'!$M$6),E10,INDIRECT('2. QT_LV'!$G$6),\"ON\",INDIRECT('2. QT_LV'!$C$6),\"Không lương\")","v":0},{"$f":"N10-O10","v":0},null,1,{"$f":"DATE(RIGHT('5.Dashboard'!$F$4,4),R10,1)","v":"2020-01-01"},{"$f":"COUNTIFS('2. QT_LV'!C:C,\"<>\"&\"Đã nghỉ việc\",'2. QT_LV'!O:O,\"<=\"&$S10,'2. QT_LV'!P:P,\">=\"&$S10,'2. QT_LV'!W:W,\"Không\")\n+COUNTIFS('2. QT_LV'!C:C,\"Đã nghỉ việc\",'2. QT_LV'!O:O,$S10)","v":0},{"$f":"COUNTIFS('2. QT_LV'!$O:$O,\">=\"&S10,'2. QT_LV'!$O:$O,\"<=\"&EOMONTH(S10,0),'2. QT_LV'!$T:$T,\"Tăng mới\")","v":0},{"$f":"COUNTIFS('3.TTNV'!AQ:AQ,\">=\"&S10,'3.TTNV'!AQ:AQ,\"<=\"&EOMONTH(S10,0))","v":0},{"$f":"T10+U10-V10","v":0},{"$f":"U10/T10","v":{"$error":"#DIV/0!"}},{"$f":"V10/AVERAGE(T10,W10)","v":{"$error":"#DIV/0!"}},null,2,{"$f":"DATE(RIGHT('5.Dashboard'!$F$4,4),AA10,1)","v":"2020-02-01"},{"$f":"COUNTIFS('2. QT_LV'!$C:$C,\"<>\"&\"Đã nghỉ việc\",'2. QT_LV'!$O:$O,\"<=\"&EOMONTH($AB10,0),'2. QT_LV'!$P:$P,\">=\"&$AB10,'2. QT_LV'!$Z:$Z,AC$8)","v":0},{"$f":"COUNTIFS('2. QT_LV'!$C:$C,\"<>\"&\"Đã nghỉ việc\",'2. QT_LV'!$O:$O,\"<=\"&EOMONTH($AB10,0),'2. QT_LV'!$P:$P,\">=\"&$AB10,'2. QT_LV'!$Z:$Z,AD$8)","v":0},0,null,{"$f":"DATE(RIGHT('5.Dashboard'!$F$4,4),AA10,1)","v":"2020-02-01"},{"$f":"COUNTIFS('2. QT_LV'!$C:$C,\"<>\"&\"Đã nghỉ việc\",'2. QT_LV'!$O:$O,\"<=\"&EOMONTH($AG10,0),'2. QT_LV'!$P:$P,\">=\"&$AG10,'2. QT_LV'!$AA:$AA,AH$8)","v":0},{"$f":"COUNTIFS('2. QT_LV'!$C:$C,\"<>\"&\"Đã nghỉ việc\",'2. QT_LV'!$O:$O,\"<=\"&EOMONTH($AG10,0),'2. QT_LV'!$P:$P,\">=\"&$AG10,'2. QT_LV'!$AA:$AA,AI$8)","v":0},{"$f":"COUNTIFS('2. QT_LV'!$C:$C,\"<>\"&\"Đã nghỉ việc\",'2. QT_LV'!$O:$O,\"<=\"&EOMONTH($AG10,0),'2. QT_LV'!$P:$P,\">=\"&$AG10,'2. QT_LV'!$AA:$AA,AJ$8)","v":0},{"$f":"COUNTIFS('2. QT_LV'!$C:$C,\"<>\"&\"Đã nghỉ việc\",'2. QT_LV'!$O:$O,\"<=\"&EOMONTH($AG10,0),'2. QT_LV'!$P:$P,\">=\"&$AG10,'2. QT_LV'!$AA:$AA,AK$8)","v":0},{"$f":"COUNTIFS('2. QT_LV'!$C:$C,\"<>\"&\"Đã nghỉ việc\",'2. QT_LV'!$O:$O,\"<=\"&EOMONTH($AG10,0),'2. QT_LV'!$P:$P,\">=\"&$AG10,'2. QT_LV'!$AA:$AA,AL$8)","v":0},{"$f":"COUNTIFS('2. QT_LV'!$C:$C,\"<>\"&\"Đã nghỉ việc\",'2. QT_LV'!$O:$O,\"<=\"&EOMONTH($AG10,0),'2. QT_LV'!$P:$P,\">=\"&$AG10,'2. QT_LV'!$AA:$AA,AM$8)","v":0},0,null,2,{"$f":"DATE(IF('5.Dashboard'!$F$4=\"Năm2019\",2019,IF('5.Dashboard'!$F$4=\"Năm2020\",2020)),AP10,1)","v":"2020-02-01"},{"$f":"COUNTIFS('2. QT_LV'!$C:$C,\"<>\"&\"Đã nghỉ việc\",'2. QT_LV'!$O:$O,\"<=\"&EOMONTH($AQ10,0),'2. QT_LV'!$P:$P,\">=\"&$AQ10,'2. QT_LV'!$AB:$AB,AR$8)","v":0},{"$f":"COUNTIFS('2. QT_LV'!$C:$C,\"<>\"&\"Đã nghỉ việc\",'2. QT_LV'!$O:$O,\"<=\"&EOMONTH($AQ10,0),'2. QT_LV'!$P:$P,\">=\"&$AQ10,'2. QT_LV'!$AB:$AB,AS$8)","v":0},{"$f":"COUNTIFS('2. QT_LV'!$C:$C,\"<>\"&\"Đã nghỉ việc\",'2. QT_LV'!$O:$O,\"<=\"&EOMONTH($AQ10,0),'2. QT_LV'!$P:$P,\">=\"&$AQ10,'2. QT_LV'!$AB:$AB,AT$8)","v":0},0]
[null,2,{"$f":"'1. QT_ĐV'!V11","v":"02. Phòng Hành chính - Nhân sự"},{"$f":"'1. QT_ĐV'!W11","v":"0"},{"$f":"'1. QT_ĐV'!X11","v":"0"},{"$f":"COUNTIFS('2. QT_LV'!K:K,C11,'2. QT_LV'!L:L,D11,'2. QT_LV'!M:M,E11,'2. QT_LV'!D:D,\"ON\",'2. QT_LV'!C:C,\"<>\"&\"Đã nghỉ việc\",'2. QT_LV'!V:V,\"<>\"&$H$4&\"Thay đổi đơn vị\",'2. QT_LV'!V:V,\"<>\"&$H$4&\"Thay đổi chức danh\",'2. QT_LV'!W:W,\"<>\"&\"Có\")\n+COUNTIFS('2. QT_LV'!K:K,C11,'2. QT_LV'!L:L,D11,'2. QT_LV'!M:M,E11,'2. QT_LV'!G:G,\"ON\",'2. QT_LV'!T:T,\"Thay đổi chức danh\",'2. QT_LV'!O:O,\"=\"&$H$4)\n+COUNTIFS('2. QT_LV'!K:K,C11,'2. QT_LV'!L:L,D11,'2. QT_LV'!M:M,E11,'2. QT_LV'!G:G,\"ON\",'2. QT_LV'!T:T,\"Thay đổi đơn vị\",'2. QT_LV'!O:O,\"=\"&$H$4)\n+COUNTIFS('2. QT_LV'!K:K,C11,'2. QT_LV'!L:L,D11,'2. QT_LV'!M:M,E11,'2. QT_LV'!D:D,\"ON\",'2. QT_LV'!U:U,\"Nghỉ việc\",'2. QT_LV'!O:O,$H$4)","v":0},{"$f":"COUNTIFS('2. QT_LV'!K:K,C11,'2. QT_LV'!L:L,D11,'2. QT_LV'!M:M,E11,'2. QT_LV'!G:G,\"ON\",'2. QT_LV'!T:T,\"Tăng mới\",'2. QT_LV'!O:O,\">=\"&$H$4)","v":0},{"$f":"COUNTIFS('2. QT_LV'!K:K,C11,'2. QT_LV'!L:L,D11,'2. QT_LV'!M:M,E11,'2. QT_LV'!G:G,\"ON\",'2. QT_LV'!T:T,\"Thay đổi chức danh\",'2. QT_LV'!O:O,\">\"&$H$4)\n+COUNTIFS('2. QT_LV'!K:K,C11,'2. QT_LV'!L:L,D11,'2. QT_LV'!M:M,E11,'2. QT_LV'!G:G,\"ON\",'2. QT_LV'!T:T,\"Thay đổi đơn vị\",'2. QT_LV'!O:O,\">\"&$H$4)","v":0},{"$f":"(_xlfn.TEXTJOIN(\"\n\",TRUE,IF(\n(INDIRECT('2. QT_LV'!$K$6)=C11)*\n(INDIRECT('2. QT_LV'!$L$6)=D11)*\n(INDIRECT('2. QT_LV'!$M$6)=E11)*\n(INDIRECT('2. QT_LV'!$G$6)=\"ON\")*\n(INDIRECT('2. QT_LV'!$T$6)=\"Tăng mới\")*\n(INDIRECT('2. QT_LV'!$O$6)>=$H$4)=1,\nINDIRECT('2. QT_LV'!$I$6)&\" \"&INDIRECT('2. QT_LV'!$Q$6),\"\")))","v":""},{"$f":"COUNTIFS('2. QT_LV'!K:K,C11,'2. QT_LV'!L:L,D11,'2. QT_LV'!M:M,E11,'2. QT_LV'!G:G,\"ON\",'2. QT_LV'!U:U,\"Nghỉ việc\",'2. QT_LV'!O:O,\">=\"&$H$4)","v":0},{"$f":"COUNTIFS('2. QT_LV'!K:K,C11,'2. QT_LV'!L:L,D11,'2. QT_LV'!M:M,E11,'2. QT_LV'!G:G,\"ON\",'2. QT_LV'!X:X,\"Có\")","v":0},{"$f":"(_xlfn.TEXTJOIN(\"\n\",TRUE,IF(\n(INDIRECT('2. QT_LV'!$K$6)=C11)*\n(INDIRECT('2. QT_LV'!$L$6)=D11)*\n(INDIRECT('2. QT_LV'!$M$6)=E11)*\n(INDIRECT('2. QT_LV'!$G$6)=\"ON\")*\n(INDIRECT('2. QT_LV'!$U$6)=\"Nghỉ việc\")*\n(INDIRECT('2. QT_LV'!$O$6)>=$H$4)=1,\nINDIRECT('2. QT_LV'!$I$6)&\" \"&INDIRECT('2. QT_LV'!$Q$6),\"\")))","v":""},null,{"$f":"COUNTIFS('2. QT_LV'!K:K,C11,'2. QT_LV'!L:L,D11,'2. QT_LV'!M:M,E11,'2. QT_LV'!E:E,\"ON\",'2. QT_LV'!C:C,\"<>\"&\"Đã nghỉ việc\")","v":0},{"$f":"COUNTIFS(INDIRECT('2. QT_LV'!$K$6),C11,INDIRECT('2. QT_LV'!$L$6),D11,INDIRECT('2. QT_LV'!$M$6),E11,INDIRECT('2. QT_LV'!$G$6),\"ON\",INDIRECT('2. QT_LV'!$C$6),\"Thai sản\")\n+COUNTIFS(INDIRECT('2. QT_LV'!$K$6),C11,INDIRECT('2. QT_LV'!$L$6),D11,INDIRECT('2. QT_LV'!$M$6),E11,INDIRECT('2. QT_LV'!$G$6),\"ON\",INDIRECT('2. QT_LV'!$C$6),\"Không lương\")","v":0},0,null,2,{"$f":"DATE(RIGHT('5.Dashboard'!$F$4,4),R11,1)","v":"2020-02-01"},{"$f":"COUNTIFS('2. QT_LV'!C:C,\"<>\"&\"Đã nghỉ việc\",'2. QT_LV'!O:O,\"<=\"&$S11,'2. QT_LV'!P:P,\">=\"&$S11,'2. QT_LV'!W:W,\"Không\")\n+COUNTIFS('2. QT_LV'!C:C,\"Đã nghỉ việc\",'2. QT_LV'!O:O,$S11)","v":0},{"$f":"COUNTIFS('2. QT_LV'!$O:$O,\">=\"&S11,'2. QT_LV'!$O:$O,\"<=\"&EOMONTH(S11,0),'2. QT_LV'!$T:$T,\"Tăng mới\")","v":0},{"$f":"COUNTIFS('3.TTNV'!AQ:AQ,\">=\"&S11,'3.TTNV'!AQ:AQ,\"<=\"&EOMONTH(S11,0))","v":0},0,{"$error":"#DIV/0!"},{"$error":"#DIV/0!"},null,3,{"$f":"DATE(RIGHT('5.Dashboard'!$F$4,4),AA11,1)","v":"2020-03-01"},{"$f":"COUNTIFS('2. QT_LV'!$C:$C,\"<>\"&\"Đã nghỉ việc\",'2. QT_LV'!$O:$O,\"<=\"&EOMONTH($AB11,0),'2. QT_LV'!$P:$P,\">=\"&$AB11,'2. QT_LV'!$Z:$Z,AC$8)","v":0},{"$f":"COUNTIFS('2. QT_LV'!$C:$C,\"<>\"&\"Đã nghỉ việc\",'2. QT_LV'!$O:$O,\"<=\"&EOMONTH($AB11,0),'2. QT_LV'!$P:$P,\">=\"&$AB11,'2. QT_LV'!$Z:$Z,AD$8)","v":0},0,null,{"$f":"DATE(RIGHT('5.Dashboard'!$F$4,4),AA11,1)","v":"2020-03-01"},{"$f":"COUNTIFS('2. QT_LV'!$C:$C,\"<>\"&\"Đã nghỉ việc\",'2. QT_LV'!$O:$O,\"<=\"&EOMONTH($AG11,0),'2. QT_LV'!$P:$P,\">=\"&$AG11,'2. QT_LV'!$AA:$AA,AH$8)","v":0},{"$f":"COUNTIFS('2. QT_LV'!$C:$C,\"<>\"&\"Đã nghỉ việc\",'2. QT_LV'!$O:$O,\"<=\"&EOMONTH($AG11,0),'2. QT_LV'!$P:$P,\">=\"&$AG11,'2. QT_LV'!$AA:$AA,AI$8)","v":0},{"$f":"COUNTIFS('2. QT_LV'!$C:$C,\"<>\"&\"Đã nghỉ việc\",'2. QT_LV'!$O:$O,\"<=\"&EOMONTH($AG11,0),'2. QT_LV'!$P:$P,\">=\"&$AG11,'2. QT_LV'!$AA:$AA,AJ$8)","v":0},{"$f":"COUNTIFS('2. QT_LV'!$C:$C,\"<>\"&\"Đã nghỉ việc\",'2. QT_LV'!$O:$O,\"<=\"&EOMONTH($AG11,0),'2. QT_LV'!$P:$P,\">=\"&$AG11,'2. QT_LV'!$AA:$AA,AK$8)","v":0},{"$f":"COUNTIFS('2. QT_LV'!$C:$C,\"<>\"&\"Đã nghỉ việc\",'2. QT_LV'!$O:$O,\"<=\"&EOMONTH($AG11,0),'2. QT_LV'!$P:$P,\">=\"&$AG11,'2. QT_LV'!$AA:$AA,AL$8)","v":0},{"$f":"COUNTIFS('2. QT_LV'!$C:$C,\"<>\"&\"Đã nghỉ việc\",'2. QT_LV'!$O:$O,\"<=\"&EOMONTH($AG11,0),'2. QT_LV'!$P:$P,\">=\"&$AG11,'2. QT_LV'!$AA:$AA,AM$8)","v":0},0,null,3,{"$f":"DATE(IF('5.Dashboard'!$F$4=\"Năm2019\",2019,IF('5.Dashboard'!$F$4=\"Năm2020\",2020)),AP11,1)","v":"2020-03-01"},{"$f":"COUNTIFS('2. QT_LV'!$C:$C,\"<>\"&\"Đã nghỉ việc\",'2. QT_LV'!$O:$O,\"<=\"&EOMONTH($AQ11,0),'2. QT_LV'!$P:$P,\">=\"&$AQ11,'2. QT_LV'!$AB:$AB,AR$8)","v":0},{"$f":"COUNTIFS('2. QT_LV'!$C:$C,\"<>\"&\"Đã nghỉ việc\",'2. QT_LV'!$O:$O,\"<=\"&EOMONTH($AQ11,0),'2. QT_LV'!$P:$P,\">=\"&$AQ11,'2. QT_LV'!$AB:$AB,AS$8)","v":0},{"$f":"COUNTIFS('2. QT_LV'!$C:$C,\"<>\"&\"Đã nghỉ việc\",'2. QT_LV'!$O:$O,\"<=\"&EOMONTH($AQ11,0),'2. QT_LV'!$P:$P,\">=\"&$AQ11,'2. QT_LV'!$AB:$AB,AT$8)","v":0},0]
[null,3,{"$f":"'1. QT_ĐV'!V12","v":"03. Phòng Kế toán"},{"$f":"'1. QT_ĐV'!W12","v":"0"},{"$f":"'1. QT_ĐV'!X12","v":"0"},{"$f":"COUNTIFS('2. QT_LV'!K:K,C12,'2. QT_LV'!L:L,D12,'2. QT_LV'!M:M,E12,'2. QT_LV'!D:D,\"ON\",'2. QT_LV'!C:C,\"<>\"&\"Đã nghỉ việc\",'2. QT_LV'!V:V,\"<>\"&$H$4&\"Thay đổi đơn vị\",'2. QT_LV'!V:V,\"<>\"&$H$4&\"Thay đổi chức danh\",'2. QT_LV'!W:W,\"<>\"&\"Có\")\n+COUNTIFS('2. QT_LV'!K:K,C12,'2. QT_LV'!L:L,D12,'2. QT_LV'!M:M,E12,'2. QT_LV'!G:G,\"ON\",'2. QT_LV'!T:T,\"Thay đổi chức danh\",'2. QT_LV'!O:O,\"=\"&$H$4)\n+COUNTIFS('2. QT_LV'!K:K,C12,'2. QT_LV'!L:L,D12,'2. QT_LV'!M:M,E12,'2. QT_LV'!G:G,\"ON\",'2. QT_LV'!T:T,\"Thay đổi đơn vị\",'2. QT_LV'!O:O,\"=\"&$H$4)\n+COUNTIFS('2. QT_LV'!K:K,C12,'2. QT_LV'!L:L,D12,'2. QT_LV'!M:M,E12,'2. QT_LV'!D:D,\"ON\",'2. QT_LV'!U:U,\"Nghỉ việc\",'2. QT_LV'!O:O,$H$4)","v":0},{"$f":"COUNTIFS('2. QT_LV'!K:K,C12,'2. QT_LV'!L:L,D12,'2. QT_LV'!M:M,E12,'2. QT_LV'!G:G,\"ON\",'2. QT_LV'!T:T,\"Tăng mới\",'2. QT_LV'!O:O,\">=\"&$H$4)","v":0},{"$f":"COUNTIFS('2. QT_LV'!K:K,C12,'2. QT_LV'!L:L,D12,'2. QT_LV'!M:M,E12,'2. QT_LV'!G:G,\"ON\",'2. QT_LV'!T:T,\"Thay đổi chức danh\",'2. QT_LV'!O:O,\">\"&$H$4)\n+COUNTIFS('2. QT_LV'!K:K,C12,'2. QT_LV'!L:L,D12,'2. QT_LV'!M:M,E12,'2. QT_LV'!G:G,\"ON\",'2. QT_LV'!T:T,\"Thay đổi đơn vị\",'2. QT_LV'!O:O,\">\"&$H$4)","v":0},{"$f":"(_xlfn.TEXTJOIN(\"\n\",TRUE,IF(\n(INDIRECT('2. QT_LV'!$K$6)=C12)*\n(INDIRECT('2. QT_LV'!$L$6)=D12)*\n(INDIRECT('2. QT_LV'!$M$6)=E12)*\n(INDIRECT('2. QT_LV'!$G$6)=\"ON\")*\n(INDIRECT('2. QT_LV'!$T$6)=\"Tăng mới\")*\n(INDIRECT('2. QT_LV'!$O$6)>=$H$4)=1,\nINDIRECT('2. QT_LV'!$I$6)&\" \"&INDIRECT('2. QT_LV'!$Q$6),\"\")))","v":""},{"$f":"COUNTIFS('2. QT_LV'!K:K,C12,'2. QT_LV'!L:L,D12,'2. QT_LV'!M:M,E12,'2. QT_LV'!G:G,\"ON\",'2. QT_LV'!U:U,\"Nghỉ việc\",'2. QT_LV'!O:O,\">=\"&$H$4)","v":0},{"$f":"COUNTIFS('2. QT_LV'!K:K,C12,'2. QT_LV'!L:L,D12,'2. QT_LV'!M:M,E12,'2. QT_LV'!G:G,\"ON\",'2. QT_LV'!X:X,\"Có\")","v":0},{"$f":"(_xlfn.TEXTJOIN(\"\n\",TRUE,IF(\n(INDIRECT('2. QT_LV'!$K$6)=C12)*\n(INDIRECT('2. QT_LV'!$L$6)=D12)*\n(INDIRECT('2. QT_LV'!$M$6)=E12)*\n(INDIRECT('2. QT_LV'!$G$6)=\"ON\")*\n(INDIRECT('2. QT_LV'!$U$6)=\"Nghỉ việc\")*\n(INDIRECT('2. QT_LV'!$O$6)>=$H$4)=1,\nINDIRECT('2. QT_LV'!$I$6)&\" \"&INDIRECT('2. QT_LV'!$Q$6),\"\")))","v":""},null,{"$f":"COUNTIFS('2. QT_LV'!K:K,C12,'2. QT_LV'!L:L,D12,'2. QT_LV'!M:M,E12,'2. QT_LV'!E:E,\"ON\",'2. QT_LV'!C:C,\"<>\"&\"Đã nghỉ việc\")","v":0},{"$f":"COUNTIFS(INDIRECT('2. QT_LV'!$K$6),C12,INDIRECT('2. QT_LV'!$L$6),D12,INDIRECT('2. QT_LV'!$M$6),E12,INDIRECT('2. QT_LV'!$G$6),\"ON\",INDIRECT('2. QT_LV'!$C$6),\"Thai sản\")\n+COUNTIFS(INDIRECT('2. QT_LV'!$K$6),C12,INDIRECT('2. QT_LV'!$L$6),D12,INDIRECT('2. QT_LV'!$M$6),E12,INDIRECT('2. QT_LV'!$G$6),\"ON\",INDIRECT('2. QT_LV'!$C$6),\"Không lương\")","v":0},0,null,3,{"$f":"DATE(RIGHT('5.Dashboard'!$F$4,4),R12,1)","v":"2020-03-01"},{"$f":"COUNTIFS('2. QT_LV'!C:C,\"<>\"&\"Đã nghỉ việc\",'2. QT_LV'!O:O,\"<=\"&$S12,'2. QT_LV'!P:P,\">=\"&$S12,'2. QT_LV'!W:W,\"Không\")\n+COUNTIFS('2. QT_LV'!C:C,\"Đã nghỉ việc\",'2. QT_LV'!O:O,$S12)","v":0},{"$f":"COUNTIFS('2. QT_LV'!$O:$O,\">=\"&S12,'2. QT_LV'!$O:$O,\"<=\"&EOMONTH(S12,0),'2. QT_LV'!$T:$T,\"Tăng mới\")","v":0},{"$f":"COUNTIFS('3.TTNV'!AQ:AQ,\">=\"&S12,'3.TTNV'!AQ:AQ,\"<=\"&EOMONTH(S12,0))","v":0},0,{"$error":"#DIV/0!"},{"$error":"#DIV/0!"},null,4,{"$f":"DATE(RIGHT('5.Dashboard'!$F$4,4),AA12,1)","v":"2020-04-01"},{"$f":"COUNTIFS('2. QT_LV'!$C:$C,\"<>\"&\"Đã nghỉ việc\",'2. QT_LV'!$O:$O,\"<=\"&EOMONTH($AB12,0),'2. QT_LV'!$P:$P,\">=\"&$AB12,'2. QT_LV'!$Z:$Z,AC$8)","v":0},{"$f":"COUNTIFS('2. QT_LV'!$C:$C,\"<>\"&\"Đã nghỉ việc\",'2. QT_LV'!$O:$O,\"<=\"&EOMONTH($AB12,0),'2. QT_LV'!$P:$P,\">=\"&$AB12,'2. QT_LV'!$Z:$Z,AD$8)","v":0},0,null,{"$f":"DATE(RIGHT('5.Dashboard'!$F$4,4),AA12,1)","v":"2020-04-01"},{"$f":"COUNTIFS('2. QT_LV'!$C:$C,\"<>\"&\"Đã nghỉ việc\",'2. QT_LV'!$O:$O,\"<=\"&EOMONTH($AG12,0),'2. QT_LV'!$P:$P,\">=\"&$AG12,'2. QT_LV'!$AA:$AA,AH$8)","v":0},{"$f":"COUNTIFS('2. QT_LV'!$C:$C,\"<>\"&\"Đã nghỉ việc\",'2. QT_LV'!$O:$O,\"<=\"&EOMONTH($AG12,0),'2. QT_LV'!$P:$P,\">=\"&$AG12,'2. QT_LV'!$AA:$AA,AI$8)","v":0},{"$f":"COUNTIFS('2. QT_LV'!$C:$C,\"<>\"&\"Đã nghỉ việc\",'2. QT_LV'!$O:$O,\"<=\"&EOMONTH($AG12,0),'2. QT_LV'!$P:$P,\">=\"&$AG12,'2. QT_LV'!$AA:$AA,AJ$8)","v":0},{"$f":"COUNTIFS('2. QT_LV'!$C:$C,\"<>\"&\"Đã nghỉ việc\",'2. QT_LV'!$O:$O,\"<=\"&EOMONTH($AG12,0),'2. QT_LV'!$P:$P,\">=\"&$AG12,'2. QT_LV'!$AA:$AA,AK$8)","v":0},{"$f":"COUNTIFS('2. QT_LV'!$C:$C,\"<>\"&\"Đã nghỉ việc\",'2. QT_LV'!$O:$O,\"<=\"&EOMONTH($AG12,0),'2. QT_LV'!$P:$P,\">=\"&$AG12,'2. QT_LV'!$AA:$AA,AL$8)","v":0},{"$f":"COUNTIFS('2. QT_LV'!$C:$C,\"<>\"&\"Đã nghỉ việc\",'2. QT_LV'!$O:$O,\"<=\"&EOMONTH($AG12,0),'2. QT_LV'!$P:$P,\">=\"&$AG12,'2. QT_LV'!$AA:$AA,AM$8)","v":0},0,null,4,{"$f":"DATE(IF('5.Dashboard'!$F$4=\"Năm2019\",2019,IF('5.Dashboard'!$F$4=\"Năm2020\",2020)),AP12,1)","v":"2020-04-01"},{"$f":"COUNTIFS('2. QT_LV'!$C:$C,\"<>\"&\"Đã nghỉ việc\",'2. QT_LV'!$O:$O,\"<=\"&EOMONTH($AQ12,0),'2. QT_LV'!$P:$P,\">=\"&$AQ12,'2. QT_LV'!$AB:$AB,AR$8)","v":0},{"$f":"COUNTIFS('2. QT_LV'!$C:$C,\"<>\"&\"Đã nghỉ việc\",'2. QT_LV'!$O:$O,\"<=\"&EOMONTH($AQ12,0),'2. QT_LV'!$P:$P,\">=\"&$AQ12,'2. QT_LV'!$AB:$AB,AS$8)","v":0},{"$f":"COUNTIFS('2. QT_LV'!$C:$C,\"<>\"&\"Đã nghỉ việc\",'2. QT_LV'!$O:$O,\"<=\"&EOMONTH($AQ12,0),'2. QT_LV'!$P:$P,\">=\"&$AQ12,'2. QT_LV'!$AB:$AB,AT$8)","v":0},0]
[null,4,{"$f":"'1. QT_ĐV'!V13","v":"03. Phòng Kế toán"},{"$f":"'1. QT_ĐV'!W13","v":"0"},{"$f":"'1. QT_ĐV'!X13","v":"Kho"},{"$f":"COUNTIFS('2. QT_LV'!K:K,C13,'2. QT_LV'!L:L,D13,'2. QT_LV'!M:M,E13,'2. QT_LV'!D:D,\"ON\",'2. QT_LV'!C:C,\"<>\"&\"Đã nghỉ việc\",'2. QT_LV'!V:V,\"<>\"&$H$4&\"Thay đổi đơn vị\",'2. QT_LV'!V:V,\"<>\"&$H$4&\"Thay đổi chức danh\",'2. QT_LV'!W:W,\"<>\"&\"Có\")\n+COUNTIFS('2. QT_LV'!K:K,C13,'2. QT_LV'!L:L,D13,'2. QT_LV'!M:M,E13,'2. QT_LV'!G:G,\"ON\",'2. QT_LV'!T:T,\"Thay đổi chức danh\",'2. QT_LV'!O:O,\"=\"&$H$4)\n+COUNTIFS('2. QT_LV'!K:K,C13,'2. QT_LV'!L:L,D13,'2. QT_LV'!M:M,E13,'2. QT_LV'!G:G,\"ON\",'2. QT_LV'!T:T,\"Thay đổi đơn vị\",'2. QT_LV'!O:O,\"=\"&$H$4)\n+COUNTIFS('2. QT_LV'!K:K,C13,'2. QT_LV'!L:L,D13,'2. QT_LV'!M:M,E13,'2. QT_LV'!D:D,\"ON\",'2. QT_LV'!U:U,\"Nghỉ việc\",'2. QT_LV'!O:O,$H$4)","v":0},{"$f":"COUNTIFS('2. QT_LV'!K:K,C13,'2. QT_LV'!L:L,D13,'2. QT_LV'!M:M,E13,'2. QT_LV'!G:G,\"ON\",'2. QT_LV'!T:T,\"Tăng mới\",'2. QT_LV'!O:O,\">=\"&$H$4)","v":0},{"$f":"COUNTIFS('2. QT_LV'!K:K,C13,'2. QT_LV'!L:L,D13,'2. QT_LV'!M:M,E13,'2. QT_LV'!G:G,\"ON\",'2. QT_LV'!T:T,\"Thay đổi chức danh\",'2. QT_LV'!O:O,\">\"&$H$4)\n+COUNTIFS('2. QT_LV'!K:K,C13,'2. QT_LV'!L:L,D13,'2. QT_LV'!M:M,E13,'2. QT_LV'!G:G,\"ON\",'2. QT_LV'!T:T,\"Thay đổi đơn vị\",'2. QT_LV'!O:O,\">\"&$H$4)","v":0},{"$f":"(_xlfn.TEXTJOIN(\"\n\",TRUE,IF(\n(INDIRECT('2. QT_LV'!$K$6)=C13)*\n(INDIRECT('2. QT_LV'!$L$6)=D13)*\n(INDIRECT('2. QT_LV'!$M$6)=E13)*\n(INDIRECT('2. QT_LV'!$G$6)=\"ON\")*\n(INDIRECT('2. QT_LV'!$T$6)=\"Tăng mới\")*\n(INDIRECT('2. QT_LV'!$O$6)>=$H$4)=1,\nINDIRECT('2. QT_LV'!$I$6)&\" \"&INDIRECT('2. QT_LV'!$Q$6),\"\")))","v":""},{"$f":"COUNTIFS('2. QT_LV'!K:K,C13,'2. QT_LV'!L:L,D13,'2. QT_LV'!M:M,E13,'2. QT_LV'!G:G,\"ON\",'2. QT_LV'!U:U,\"Nghỉ việc\",'2. QT_LV'!O:O,\">=\"&$H$4)","v":0},{"$f":"COUNTIFS('2. QT_LV'!K:K,C13,'2. QT_LV'!L:L,D13,'2. QT_LV'!M:M,E13,'2. QT_LV'!G:G,\"ON\",'2. QT_LV'!X:X,\"Có\")","v":0},{"$f":"(_xlfn.TEXTJOIN(\"\n\",TRUE,IF(\n(INDIRECT('2. QT_LV'!$K$6)=C13)*\n(INDIRECT('2. QT_LV'!$L$6)=D13)*\n(INDIRECT('2. QT_LV'!$M$6)=E13)*\n(INDIRECT('2. QT_LV'!$G$6)=\"ON\")*\n(INDIRECT('2. QT_LV'!$U$6)=\"Nghỉ việc\")*\n(INDIRECT('2. QT_LV'!$O$6)>=$H$4)=1,\nINDIRECT('2. QT_LV'!$I$6)&\" \"&INDIRECT('2. QT_LV'!$Q$6),\"\")))","v":""},null,{"$f":"COUNTIFS('2. QT_LV'!K:K,C13,'2. QT_LV'!L:L,D13,'2. QT_LV'!M:M,E13,'2. QT_LV'!E:E,\"ON\",'2. QT_LV'!C:C,\"<>\"&\"Đã nghỉ việc\")","v":0},{"$f":"COUNTIFS(INDIRECT('2. QT_LV'!$K$6),C13,INDIRECT('2. QT_LV'!$L$6),D13,INDIRECT('2. QT_LV'!$M$6),E13,INDIRECT('2. QT_LV'!$G$6),\"ON\",INDIRECT('2. QT_LV'!$C$6),\"Thai sản\")\n+COUNTIFS(INDIRECT('2. QT_LV'!$K$6),C13,INDIRECT('2. QT_LV'!$L$6),D13,INDIRECT('2. QT_LV'!$M$6),E13,INDIRECT('2. QT_LV'!$G$6),\"ON\",INDIRECT('2. QT_LV'!$C$6),\"Không lương\")","v":0},0,null,4,{"$f":"DATE(RIGHT('5.Dashboard'!$F$4,4),R13,1)","v":"2020-04-01"},{"$f":"COUNTIFS('2. QT_LV'!C:C,\"<>\"&\"Đã nghỉ việc\",'2. QT_LV'!O:O,\"<=\"&$S13,'2. QT_LV'!P:P,\">=\"&$S13,'2. QT_LV'!W:W,\"Không\")\n+COUNTIFS('2. QT_LV'!C:C,\"Đã nghỉ việc\",'2. QT_LV'!O:O,$S13)","v":0},{"$f":"COUNTIFS('2. QT_LV'!$O:$O,\">=\"&S13,'2. QT_LV'!$O:$O,\"<=\"&EOMONTH(S13,0),'2. QT_LV'!$T:$T,\"Tăng mới\")","v":0},{"$f":"COUNTIFS('3.TTNV'!AQ:AQ,\">=\"&S13,'3.TTNV'!AQ:AQ,\"<=\"&EOMONTH(S13,0))","v":0},0,{"$error":"#DIV/0!"},{"$error":"#DIV/0!"},null,5,{"$f":"DATE(RIGHT('5.Dashboard'!$F$4,4),AA13,1)","v":"2020-05-01"},{"$f":"COUNTIFS('2. QT_LV'!$C:$C,\"<>\"&\"Đã nghỉ việc\",'2. QT_LV'!$O:$O,\"<=\"&EOMONTH($AB13,0),'2. QT_LV'!$P:$P,\">=\"&$AB13,'2. QT_LV'!$Z:$Z,AC$8)","v":0},{"$f":"COUNTIFS('2. QT_LV'!$C:$C,\"<>\"&\"Đã nghỉ việc\",'2. QT_LV'!$O:$O,\"<=\"&EOMONTH($AB13,0),'2. QT_LV'!$P:$P,\">=\"&$AB13,'2. QT_LV'!$Z:$Z,AD$8)","v":0},0,null,{"$f":"DATE(RIGHT('5.Dashboard'!$F$4,4),AA13,1)","v":"2020-05-01"},{"$f":"COUNTIFS('2. QT_LV'!$C:$C,\"<>\"&\"Đã nghỉ việc\",'2. QT_LV'!$O:$O,\"<=\"&EOMONTH($AG13,0),'2. QT_LV'!$P:$P,\">=\"&$AG13,'2. QT_LV'!$AA:$AA,AH$8)","v":0},{"$f":"COUNTIFS('2. QT_LV'!$C:$C,\"<>\"&\"Đã nghỉ việc\",'2. QT_LV'!$O:$O,\"<=\"&EOMONTH($AG13,0),'2. QT_LV'!$P:$P,\">=\"&$AG13,'2. QT_LV'!$AA:$AA,AI$8)","v":0},{"$f":"COUNTIFS('2. QT_LV'!$C:$C,\"<>\"&\"Đã nghỉ việc\",'2. QT_LV'!$O:$O,\"<=\"&EOMONTH($AG13,0),'2. QT_LV'!$P:$P,\">=\"&$AG13,'2. QT_LV'!$AA:$AA,AJ$8)","v":0},{"$f":"COUNTIFS('2. QT_LV'!$C:$C,\"<>\"&\"Đã nghỉ việc\",'2. QT_LV'!$O:$O,\"<=\"&EOMONTH($AG13,0),'2. QT_LV'!$P:$P,\">=\"&$AG13,'2. QT_LV'!$AA:$AA,AK$8)","v":0},{"$f":"COUNTIFS('2. QT_LV'!$C:$C,\"<>\"&\"Đã nghỉ việc\",'2. QT_LV'!$O:$O,\"<=\"&EOMONTH($AG13,0),'2. QT_LV'!$P:$P,\">=\"&$AG13,'2. QT_LV'!$AA:$AA,AL$8)","v":0},{"$f":"COUNTIFS('2. QT_LV'!$C:$C,\"<>\"&\"Đã nghỉ việc\",'2. QT_LV'!$O:$O,\"<=\"&EOMONTH($AG13,0),'2. QT_LV'!$P:$P,\">=\"&$AG13,'2. QT_LV'!$AA:$AA,AM$8)","v":0},0,null,5,{"$f":"DATE(IF('5.Dashboard'!$F$4=\"Năm2019\",2019,IF('5.Dashboard'!$F$4=\"Năm2020\",2020)),AP13,1)","v":"2020-05-01"},{"$f":"COUNTIFS('2. QT_LV'!$C:$C,\"<>\"&\"Đã nghỉ việc\",'2. QT_LV'!$O:$O,\"<=\"&EOMONTH($AQ13,0),'2. QT_LV'!$P:$P,\">=\"&$AQ13,'2. QT_LV'!$AB:$AB,AR$8)","v":0},{"$f":"COUNTIFS('2. QT_LV'!$C:$C,\"<>\"&\"Đã nghỉ việc\",'2. QT_LV'!$O:$O,\"<=\"&EOMONTH($AQ13,0),'2. QT_LV'!$P:$P,\">=\"&$AQ13,'2. QT_LV'!$AB:$AB,AS$8)","v":0},{"$f":"COUNTIFS('2. QT_LV'!$C:$C,\"<>\"&\"Đã nghỉ việc\",'2. QT_LV'!$O:$O,\"<=\"&EOMONTH($AQ13,0),'2. QT_LV'!$P:$P,\">=\"&$AQ13,'2. QT_LV'!$AB:$AB,AT$8)","v":0},0]
[null,5,{"$f":"'1. QT_ĐV'!V14","v":"04. Phòng Kinh doanh"},{"$f":"'1. QT_ĐV'!W14","v":"0"},{"$f":"'1. QT_ĐV'!X14","v":"0"},{"$f":"COUNTIFS('2. QT_LV'!K:K,C14,'2. QT_LV'!L:L,D14,'2. QT_LV'!M:M,E14,'2. QT_LV'!D:D,\"ON\",'2. QT_LV'!C:C,\"<>\"&\"Đã nghỉ việc\",'2. QT_LV'!V:V,\"<>\"&$H$4&\"Thay đổi đơn vị\",'2. QT_LV'!V:V,\"<>\"&$H$4&\"Thay đổi chức danh\",'2. QT_LV'!W:W,\"<>\"&\"Có\")\n+COUNTIFS('2. QT_LV'!K:K,C14,'2. QT_LV'!L:L,D14,'2. QT_LV'!M:M,E14,'2. QT_LV'!G:G,\"ON\",'2. QT_LV'!T:T,\"Thay đổi chức danh\",'2. QT_LV'!O:O,\"=\"&$H$4)\n+COUNTIFS('2. QT_LV'!K:K,C14,'2. QT_LV'!L:L,D14,'2. QT_LV'!M:M,E14,'2. QT_LV'!G:G,\"ON\",'2. QT_LV'!T:T,\"Thay đổi đơn vị\",'2. QT_LV'!O:O,\"=\"&$H$4)\n+COUNTIFS('2. QT_LV'!K:K,C14,'2. QT_LV'!L:L,D14,'2. QT_LV'!M:M,E14,'2. QT_LV'!D:D,\"ON\",'2. QT_LV'!U:U,\"Nghỉ việc\",'2. QT_LV'!O:O,$H$4)","v":0},{"$f":"COUNTIFS('2. QT_LV'!K:K,C14,'2. QT_LV'!L:L,D14,'2. QT_LV'!M:M,E14,'2. QT_LV'!G:G,\"ON\",'2. QT_LV'!T:T,\"Tăng mới\",'2. QT_LV'!O:O,\">=\"&$H$4)","v":0},{"$f":"COUNTIFS('2. QT_LV'!K:K,C14,'2. QT_LV'!L:L,D14,'2. QT_LV'!M:M,E14,'2. QT_LV'!G:G,\"ON\",'2. QT_LV'!T:T,\"Thay đổi chức danh\",'2. QT_LV'!O:O,\">\"&$H$4)\n+COUNTIFS('2. QT_LV'!K:K,C14,'2. QT_LV'!L:L,D14,'2. QT_LV'!M:M,E14,'2. QT_LV'!G:G,\"ON\",'2. QT_LV'!T:T,\"Thay đổi đơn vị\",'2. QT_LV'!O:O,\">\"&$H$4)","v":0},{"$f":"(_xlfn.TEXTJOIN(\"\n\",TRUE,IF(\n(INDIRECT('2. QT_LV'!$K$6)=C14)*\n(INDIRECT('2. QT_LV'!$L$6)=D14)*\n(INDIRECT('2. QT_LV'!$M$6)=E14)*\n(INDIRECT('2. QT_LV'!$G$6)=\"ON\")*\n(INDIRECT('2. QT_LV'!$T$6)=\"Tăng mới\")*\n(INDIRECT('2. QT_LV'!$O$6)>=$H$4)=1,\nINDIRECT('2. QT_LV'!$I$6)&\" \"&INDIRECT('2. QT_LV'!$Q$6),\"\")))","v":""},{"$f":"COUNTIFS('2. QT_LV'!K:K,C14,'2. QT_LV'!L:L,D14,'2. QT_LV'!M:M,E14,'2. QT_LV'!G:G,\"ON\",'2. QT_LV'!U:U,\"Nghỉ việc\",'2. QT_LV'!O:O,\">=\"&$H$4)","v":0},{"$f":"COUNTIFS('2. QT_LV'!K:K,C14,'2. QT_LV'!L:L,D14,'2. QT_LV'!M:M,E14,'2. QT_LV'!G:G,\"ON\",'2. QT_LV'!X:X,\"Có\")","v":0},{"$f":"(_xlfn.TEXTJOIN(\"\n\",TRUE,IF(\n(INDIRECT('2. QT_LV'!$K$6)=C14)*\n(INDIRECT('2. QT_LV'!$L$6)=D14)*\n(INDIRECT('2. QT_LV'!$M$6)=E14)*\n(INDIRECT('2. QT_LV'!$G$6)=\"ON\")*\n(INDIRECT('2. QT_LV'!$U$6)=\"Nghỉ việc\")*\n(INDIRECT('2. QT_LV'!$O$6)>=$H$4)=1,\nINDIRECT('2. QT_LV'!$I$6)&\" \"&INDIRECT('2. QT_LV'!$Q$6),\"\")))","v":""},null,{"$f":"COUNTIFS('2. QT_LV'!K:K,C14,'2. QT_LV'!L:L,D14,'2. QT_LV'!M:M,E14,'2. QT_LV'!E:E,\"ON\",'2. QT_LV'!C:C,\"<>\"&\"Đã nghỉ việc\")","v":0},{"$f":"COUNTIFS(INDIRECT('2. QT_LV'!$K$6),C14,INDIRECT('2. QT_LV'!$L$6),D14,INDIRECT('2. QT_LV'!$M$6),E14,INDIRECT('2. QT_LV'!$G$6),\"ON\",INDIRECT('2. QT_LV'!$C$6),\"Thai sản\")\n+COUNTIFS(INDIRECT('2. QT_LV'!$K$6),C14,INDIRECT('2. QT_LV'!$L$6),D14,INDIRECT('2. QT_LV'!$M$6),E14,INDIRECT('2. QT_LV'!$G$6),\"ON\",INDIRECT('2. QT_LV'!$C$6),\"Không lương\")","v":0},0,null,5,{"$f":"DATE(RIGHT('5.Dashboard'!$F$4,4),R14,1)","v":"2020-05-01"},{"$f":"COUNTIFS('2. QT_LV'!C:C,\"<>\"&\"Đã nghỉ việc\",'2. QT_LV'!O:O,\"<=\"&$S14,'2. QT_LV'!P:P,\">=\"&$S14,'2. QT_LV'!W:W,\"Không\")\n+COUNTIFS('2. QT_LV'!C:C,\"Đã nghỉ việc\",'2. QT_LV'!O:O,$S14)","v":0},{"$f":"COUNTIFS('2. QT_LV'!$O:$O,\">=\"&S14,'2. QT_LV'!$O:$O,\"<=\"&EOMONTH(S14,0),'2. QT_LV'!$T:$T,\"Tăng mới\")","v":0},{"$f":"COUNTIFS('3.TTNV'!AQ:AQ,\">=\"&S14,'3.TTNV'!AQ:AQ,\"<=\"&EOMONTH(S14,0))","v":0},0,{"$error":"#DIV/0!"},{"$error":"#DIV/0!"},null,6,{"$f":"DATE(RIGHT('5.Dashboard'!$F$4,4),AA14,1)","v":"2020-06-01"},{"$f":"COUNTIFS('2. QT_LV'!$C:$C,\"<>\"&\"Đã nghỉ việc\",'2. QT_LV'!$O:$O,\"<=\"&EOMONTH($AB14,0),'2. QT_LV'!$P:$P,\">=\"&$AB14,'2. QT_LV'!$Z:$Z,AC$8)","v":0},{"$f":"COUNTIFS('2. QT_LV'!$C:$C,\"<>\"&\"Đã nghỉ việc\",'2. QT_LV'!$O:$O,\"<=\"&EOMONTH($AB14,0),'2. QT_LV'!$P:$P,\">=\"&$AB14,'2. QT_LV'!$Z:$Z,AD$8)","v":0},0,null,{"$f":"DATE(RIGHT('5.Dashboard'!$F$4,4),AA14,1)","v":"2020-06-01"},{"$f":"COUNTIFS('2. QT_LV'!$C:$C,\"<>\"&\"Đã nghỉ việc\",'2. QT_LV'!$O:$O,\"<=\"&EOMONTH($AG14,0),'2. QT_LV'!$P:$P,\">=\"&$AG14,'2. QT_LV'!$AA:$AA,AH$8)","v":0},{"$f":"COUNTIFS('2. QT_LV'!$C:$C,\"<>\"&\"Đã nghỉ việc\",'2. QT_LV'!$O:$O,\"<=\"&EOMONTH($AG14,0),'2. QT_LV'!$P:$P,\">=\"&$AG14,'2. QT_LV'!$AA:$AA,AI$8)","v":0},{"$f":"COUNTIFS('2. QT_LV'!$C:$C,\"<>\"&\"Đã nghỉ việc\",'2. QT_LV'!$O:$O,\"<=\"&EOMONTH($AG14,0),'2. QT_LV'!$P:$P,\">=\"&$AG14,'2. QT_LV'!$AA:$AA,AJ$8)","v":0},{"$f":"COUNTIFS('2. QT_LV'!$C:$C,\"<>\"&\"Đã nghỉ việc\",'2. QT_LV'!$O:$O,\"<=\"&EOMONTH($AG14,0),'2. QT_LV'!$P:$P,\">=\"&$AG14,'2. QT_LV'!$AA:$AA,AK$8)","v":0},{"$f":"COUNTIFS('2. QT_LV'!$C:$C,\"<>\"&\"Đã nghỉ việc\",'2. QT_LV'!$O:$O,\"<=\"&EOMONTH($AG14,0),'2. QT_LV'!$P:$P,\">=\"&$AG14,'2. QT_LV'!$AA:$AA,AL$8)","v":0},{"$f":"COUNTIFS('2. QT_LV'!$C:$C,\"<>\"&\"Đã nghỉ việc\",'2. QT_LV'!$O:$O,\"<=\"&EOMONTH($AG14,0),'2. QT_LV'!$P:$P,\">=\"&$AG14,'2. QT_LV'!$AA:$AA,AM$8)","v":0},0,null,6,{"$f":"DATE(IF('5.Dashboard'!$F$4=\"Năm2019\",2019,IF('5.Dashboard'!$F$4=\"Năm2020\",2020)),AP14,1)","v":"2020-06-01"},{"$f":"COUNTIFS('2. QT_LV'!$C:$C,\"<>\"&\"Đã nghỉ việc\",'2. QT_LV'!$O:$O,\"<=\"&EOMONTH($AQ14,0),'2. QT_LV'!$P:$P,\">=\"&$AQ14,'2. QT_LV'!$AB:$AB,AR$8)","v":0},{"$f":"COUNTIFS('2. QT_LV'!$C:$C,\"<>\"&\"Đã nghỉ việc\",'2. QT_LV'!$O:$O,\"<=\"&EOMONTH($AQ14,0),'2. QT_LV'!$P:$P,\">=\"&$AQ14,'2. QT_LV'!$AB:$AB,AS$8)","v":0},{"$f":"COUNTIFS('2. QT_LV'!$C:$C,\"<>\"&\"Đã nghỉ việc\",'2. QT_LV'!$O:$O,\"<=\"&EOMONTH($AQ14,0),'2. QT_LV'!$P:$P,\">=\"&$AQ14,'2. QT_LV'!$AB:$AB,AT$8)","v":0},0]
[null,6,{"$f":"'1. QT_ĐV'!V15","v":"04. Phòng Kinh doanh"},{"$f":"'1. QT_ĐV'!W15","v":"0"},{"$f":"'1. QT_ĐV'!X15","v":"Nhóm Care"},{"$f":"COUNTIFS('2. QT_LV'!K:K,C15,'2. QT_LV'!L:L,D15,'2. QT_LV'!M:M,E15,'2. QT_LV'!D:D,\"ON\",'2. QT_LV'!C:C,\"<>\"&\"Đã nghỉ việc\",'2. QT_LV'!V:V,\"<>\"&$H$4&\"Thay đổi đơn vị\",'2. QT_LV'!V:V,\"<>\"&$H$4&\"Thay đổi chức danh\",'2. QT_LV'!W:W,\"<>\"&\"Có\")\n+COUNTIFS('2. QT_LV'!K:K,C15,'2. QT_LV'!L:L,D15,'2. QT_LV'!M:M,E15,'2. QT_LV'!G:G,\"ON\",'2. QT_LV'!T:T,\"Thay đổi chức danh\",'2. QT_LV'!O:O,\"=\"&$H$4)\n+COUNTIFS('2. QT_LV'!K:K,C15,'2. QT_LV'!L:L,D15,'2. QT_LV'!M:M,E15,'2. QT_LV'!G:G,\"ON\",'2. QT_LV'!T:T,\"Thay đổi đơn vị\",'2. QT_LV'!O:O,\"=\"&$H$4)\n+COUNTIFS('2. QT_LV'!K:K,C15,'2. QT_LV'!L:L,D15,'2. QT_LV'!M:M,E15,'2. QT_LV'!D:D,\"ON\",'2. QT_LV'!U:U,\"Nghỉ việc\",'2. QT_LV'!O:O,$H$4)","v":0},{"$f":"COUNTIFS('2. QT_LV'!K:K,C15,'2. QT_LV'!L:L,D15,'2. QT_LV'!M:M,E15,'2. QT_LV'!G:G,\"ON\",'2. QT_LV'!T:T,\"Tăng mới\",'2. QT_LV'!O:O,\">=\"&$H$4)","v":0},{"$f":"COUNTIFS('2. QT_LV'!K:K,C15,'2. QT_LV'!L:L,D15,'2. QT_LV'!M:M,E15,'2. QT_LV'!G:G,\"ON\",'2. QT_LV'!T:T,\"Thay đổi chức danh\",'2. QT_LV'!O:O,\">\"&$H$4)\n+COUNTIFS('2. QT_LV'!K:K,C15,'2. QT_LV'!L:L,D15,'2. QT_LV'!M:M,E15,'2. QT_LV'!G:G,\"ON\",'2. QT_LV'!T:T,\"Thay đổi đơn vị\",'2. QT_LV'!O:O,\">\"&$H$4)","v":0},{"$f":"(_xlfn.TEXTJOIN(\"\n\",TRUE,IF(\n(INDIRECT('2. QT_LV'!$K$6)=C15)*\n(INDIRECT('2. QT_LV'!$L$6)=D15)*\n(INDIRECT('2. QT_LV'!$M$6)=E15)*\n(INDIRECT('2. QT_LV'!$G$6)=\"ON\")*\n(INDIRECT('2. QT_LV'!$T$6)=\"Tăng mới\")*\n(INDIRECT('2. QT_LV'!$O$6)>=$H$4)=1,\nINDIRECT('2. QT_LV'!$I$6)&\" \"&INDIRECT('2. QT_LV'!$Q$6),\"\")))","v":""},{"$f":"COUNTIFS('2. QT_LV'!K:K,C15,'2. QT_LV'!L:L,D15,'2. QT_LV'!M:M,E15,'2. QT_LV'!G:G,\"ON\",'2. QT_LV'!U:U,\"Nghỉ việc\",'2. QT_LV'!O:O,\">=\"&$H$4)","v":0},{"$f":"COUNTIFS('2. QT_LV'!K:K,C15,'2. QT_LV'!L:L,D15,'2. QT_LV'!M:M,E15,'2. QT_LV'!G:G,\"ON\",'2. QT_LV'!X:X,\"Có\")","v":0},{"$f":"(_xlfn.TEXTJOIN(\"\n\",TRUE,IF(\n(INDIRECT('2. QT_LV'!$K$6)=C15)*\n(INDIRECT('2. QT_LV'!$L$6)=D15)*\n(INDIRECT('2. QT_LV'!$M$6)=E15)*\n(INDIRECT('2. QT_LV'!$G$6)=\"ON\")*\n(INDIRECT('2. QT_LV'!$U$6)=\"Nghỉ việc\")*\n(INDIRECT('2. QT_LV'!$O$6)>=$H$4)=1,\nINDIRECT('2. QT_LV'!$I$6)&\" \"&INDIRECT('2. QT_LV'!$Q$6),\"\")))","v":""},null,{"$f":"COUNTIFS('2. QT_LV'!K:K,C15,'2. QT_LV'!L:L,D15,'2. QT_LV'!M:M,E15,'2. QT_LV'!E:E,\"ON\",'2. QT_LV'!C:C,\"<>\"&\"Đã nghỉ việc\")","v":0},{"$f":"COUNTIFS(INDIRECT('2. QT_LV'!$K$6),C15,INDIRECT('2. QT_LV'!$L$6),D15,INDIRECT('2. QT_LV'!$M$6),E15,INDIRECT('2. QT_LV'!$G$6),\"ON\",INDIRECT('2. QT_LV'!$C$6),\"Thai sản\")\n+COUNTIFS(INDIRECT('2. QT_LV'!$K$6),C15,INDIRECT('2. QT_LV'!$L$6),D15,INDIRECT('2. QT_LV'!$M$6),E15,INDIRECT('2. QT_LV'!$G$6),\"ON\",INDIRECT('2. QT_LV'!$C$6),\"Không lương\")","v":0},0,null,6,{"$f":"DATE(RIGHT('5.Dashboard'!$F$4,4),R15,1)","v":"2020-06-01"},{"$f":"COUNTIFS('2. QT_LV'!C:C,\"<>\"&\"Đã nghỉ việc\",'2. QT_LV'!O:O,\"<=\"&$S15,'2. QT_LV'!P:P,\">=\"&$S15,'2. QT_LV'!W:W,\"Không\")\n+COUNTIFS('2. QT_LV'!C:C,\"Đã nghỉ việc\",'2. QT_LV'!O:O,$S15)","v":0},{"$f":"COUNTIFS('2. QT_LV'!$O:$O,\">=\"&S15,'2. QT_LV'!$O:$O,\"<=\"&EOMONTH(S15,0),'2. QT_LV'!$T:$T,\"Tăng mới\")","v":0},{"$f":"COUNTIFS('3.TTNV'!AQ:AQ,\">=\"&S15,'3.TTNV'!AQ:AQ,\"<=\"&EOMONTH(S15,0))","v":0},0,{"$error":"#DIV/0!"},{"$error":"#DIV/0!"},null,7,{"$f":"DATE(RIGHT('5.Dashboard'!$F$4,4),AA15,1)","v":"2020-07-01"},{"$f":"COUNTIFS('2. QT_LV'!$C:$C,\"<>\"&\"Đã nghỉ việc\",'2. QT_LV'!$O:$O,\"<=\"&EOMONTH($AB15,0),'2. QT_LV'!$P:$P,\">=\"&$AB15,'2. QT_LV'!$Z:$Z,AC$8)","v":0},{"$f":"COUNTIFS('2. QT_LV'!$C:$C,\"<>\"&\"Đã nghỉ việc\",'2. QT_LV'!$O:$O,\"<=\"&EOMONTH($AB15,0),'2. QT_LV'!$P:$P,\">=\"&$AB15,'2. QT_LV'!$Z:$Z,AD$8)","v":0},0,null,{"$f":"DATE(RIGHT('5.Dashboard'!$F$4,4),AA15,1)","v":"2020-07-01"},{"$f":"COUNTIFS('2. QT_LV'!$C:$C,\"<>\"&\"Đã nghỉ việc\",'2. QT_LV'!$O:$O,\"<=\"&EOMONTH($AG15,0),'2. QT_LV'!$P:$P,\">=\"&$AG15,'2. QT_LV'!$AA:$AA,AH$8)","v":0},{"$f":"COUNTIFS('2. QT_LV'!$C:$C,\"<>\"&\"Đã nghỉ việc\",'2. QT_LV'!$O:$O,\"<=\"&EOMONTH($AG15,0),'2. QT_LV'!$P:$P,\">=\"&$AG15,'2. QT_LV'!$AA:$AA,AI$8)","v":0},{"$f":"COUNTIFS('2. QT_LV'!$C:$C,\"<>\"&\"Đã nghỉ việc\",'2. QT_LV'!$O:$O,\"<=\"&EOMONTH($AG15,0),'2. QT_LV'!$P:$P,\">=\"&$AG15,'2. QT_LV'!$AA:$AA,AJ$8)","v":0},{"$f":"COUNTIFS('2. QT_LV'!$C:$C,\"<>\"&\"Đã nghỉ việc\",'2. QT_LV'!$O:$O,\"<=\"&EOMONTH($AG15,0),'2. QT_LV'!$P:$P,\">=\"&$AG15,'2. QT_LV'!$AA:$AA,AK$8)","v":0},{"$f":"COUNTIFS('2. QT_LV'!$C:$C,\"<>\"&\"Đã nghỉ việc\",'2. QT_LV'!$O:$O,\"<=\"&EOMONTH($AG15,0),'2. QT_LV'!$P:$P,\">=\"&$AG15,'2. QT_LV'!$AA:$AA,AL$8)","v":0},{"$f":"COUNTIFS('2. QT_LV'!$C:$C,\"<>\"&\"Đã nghỉ việc\",'2. QT_LV'!$O:$O,\"<=\"&EOMONTH($AG15,0),'2. QT_LV'!$P:$P,\">=\"&$AG15,'2. QT_LV'!$AA:$AA,AM$8)","v":0},0,null,7,{"$f":"DATE(IF('5.Dashboard'!$F$4=\"Năm2019\",2019,IF('5.Dashboard'!$F$4=\"Năm2020\",2020)),AP15,1)","v":"2020-07-01"},{"$f":"COUNTIFS('2. QT_LV'!$C:$C,\"<>\"&\"Đã nghỉ việc\",'2. QT_LV'!$O:$O,\"<=\"&EOMONTH($AQ15,0),'2. QT_LV'!$P:$P,\">=\"&$AQ15,'2. QT_LV'!$AB:$AB,AR$8)","v":0},{"$f":"COUNTIFS('2. QT_LV'!$C:$C,\"<>\"&\"Đã nghỉ việc\",'2. QT_LV'!$O:$O,\"<=\"&EOMONTH($AQ15,0),'2. QT_LV'!$P:$P,\">=\"&$AQ15,'2. QT_LV'!$AB:$AB,AS$8)","v":0},{"$f":"COUNTIFS('2. QT_LV'!$C:$C,\"<>\"&\"Đã nghỉ việc\",'2. QT_LV'!$O:$O,\"<=\"&EOMONTH($AQ15,0),'2. QT_LV'!$P:$P,\">=\"&$AQ15,'2. QT_LV'!$AB:$AB,AT$8)","v":0},0]
[null,7,{"$f":"'1. QT_ĐV'!V16","v":"04. Phòng Kinh doanh"},{"$f":"'1. QT_ĐV'!W16","v":"0"},{"$f":"'1. QT_ĐV'!X16","v":"Nhóm Pancake"},{"$f":"COUNTIFS('2. QT_LV'!K:K,C16,'2. QT_LV'!L:L,D16,'2. QT_LV'!M:M,E16,'2. QT_LV'!D:D,\"ON\",'2. QT_LV'!C:C,\"<>\"&\"Đã nghỉ việc\",'2. QT_LV'!V:V,\"<>\"&$H$4&\"Thay đổi đơn vị\",'2. QT_LV'!V:V,\"<>\"&$H$4&\"Thay đổi chức danh\",'2. QT_LV'!W:W,\"<>\"&\"Có\")\n+COUNTIFS('2. QT_LV'!K:K,C16,'2. QT_LV'!L:L,D16,'2. QT_LV'!M:M,E16,'2. QT_LV'!G:G,\"ON\",'2. QT_LV'!T:T,\"Thay đổi chức danh\",'2. QT_LV'!O:O,\"=\"&$H$4)\n+COUNTIFS('2. QT_LV'!K:K,C16,'2. QT_LV'!L:L,D16,'2. QT_LV'!M:M,E16,'2. QT_LV'!G:G,\"ON\",'2. QT_LV'!T:T,\"Thay đổi đơn vị\",'2. QT_LV'!O:O,\"=\"&$H$4)\n+COUNTIFS('2. QT_LV'!K:K,C16,'2. QT_LV'!L:L,D16,'2. QT_LV'!M:M,E16,'2. QT_LV'!D:D,\"ON\",'2. QT_LV'!U:U,\"Nghỉ việc\",'2. QT_LV'!O:O,$H$4)","v":0},{"$f":"COUNTIFS('2. QT_LV'!K:K,C16,'2. QT_LV'!L:L,D16,'2. QT_LV'!M:M,E16,'2. QT_LV'!G:G,\"ON\",'2. QT_LV'!T:T,\"Tăng mới\",'2. QT_LV'!O:O,\">=\"&$H$4)","v":0},{"$f":"COUNTIFS('2. QT_LV'!K:K,C16,'2. QT_LV'!L:L,D16,'2. QT_LV'!M:M,E16,'2. QT_LV'!G:G,\"ON\",'2. QT_LV'!T:T,\"Thay đổi chức danh\",'2. QT_LV'!O:O,\">\"&$H$4)\n+COUNTIFS('2. QT_LV'!K:K,C16,'2. QT_LV'!L:L,D16,'2. QT_LV'!M:M,E16,'2. QT_LV'!G:G,\"ON\",'2. QT_LV'!T:T,\"Thay đổi đơn vị\",'2. QT_LV'!O:O,\">\"&$H$4)","v":0},{"$f":"(_xlfn.TEXTJOIN(\"\n\",TRUE,IF(\n(INDIRECT('2. QT_LV'!$K$6)=C16)*\n(INDIRECT('2. QT_LV'!$L$6)=D16)*\n(INDIRECT('2. QT_LV'!$M$6)=E16)*\n(INDIRECT('2. QT_LV'!$G$6)=\"ON\")*\n(INDIRECT('2. QT_LV'!$T$6)=\"Tăng mới\")*\n(INDIRECT('2. QT_LV'!$O$6)>=$H$4)=1,\nINDIRECT('2. QT_LV'!$I$6)&\" \"&INDIRECT('2. QT_LV'!$Q$6),\"\")))","v":""},{"$f":"COUNTIFS('2. QT_LV'!K:K,C16,'2. QT_LV'!L:L,D16,'2. QT_LV'!M:M,E16,'2. QT_LV'!G:G,\"ON\",'2. QT_LV'!U:U,\"Nghỉ việc\",'2. QT_LV'!O:O,\">=\"&$H$4)","v":0},{"$f":"COUNTIFS('2. QT_LV'!K:K,C16,'2. QT_LV'!L:L,D16,'2. QT_LV'!M:M,E16,'2. QT_LV'!G:G,\"ON\",'2. QT_LV'!X:X,\"Có\")","v":0},{"$f":"(_xlfn.TEXTJOIN(\"\n\",TRUE,IF(\n(INDIRECT('2. QT_LV'!$K$6)=C16)*\n(INDIRECT('2. QT_LV'!$L$6)=D16)*\n(INDIRECT('2. QT_LV'!$M$6)=E16)*\n(INDIRECT('2. QT_LV'!$G$6)=\"ON\")*\n(INDIRECT('2. QT_LV'!$U$6)=\"Nghỉ việc\")*\n(INDIRECT('2. QT_LV'!$O$6)>=$H$4)=1,\nINDIRECT('2. QT_LV'!$I$6)&\" \"&INDIRECT('2. QT_LV'!$Q$6),\"\")))","v":""},null,{"$f":"COUNTIFS('2. QT_LV'!K:K,C16,'2. QT_LV'!L:L,D16,'2. QT_LV'!M:M,E16,'2. QT_LV'!E:E,\"ON\",'2. QT_LV'!C:C,\"<>\"&\"Đã nghỉ việc\")","v":0},{"$f":"COUNTIFS(INDIRECT('2. QT_LV'!$K$6),C16,INDIRECT('2. QT_LV'!$L$6),D16,INDIRECT('2. QT_LV'!$M$6),E16,INDIRECT('2. QT_LV'!$G$6),\"ON\",INDIRECT('2. QT_LV'!$C$6),\"Thai sản\")\n+COUNTIFS(INDIRECT('2. QT_LV'!$K$6),C16,INDIRECT('2. QT_LV'!$L$6),D16,INDIRECT('2. QT_LV'!$M$6),E16,INDIRECT('2. QT_LV'!$G$6),\"ON\",INDIRECT('2. QT_LV'!$C$6),\"Không lương\")","v":0},0,null,7,{"$f":"DATE(RIGHT('5.Dashboard'!$F$4,4),R16,1)","v":"2020-07-01"},{"$f":"COUNTIFS('2. QT_LV'!C:C,\"<>\"&\"Đã nghỉ việc\",'2. QT_LV'!O:O,\"<=\"&$S16,'2. QT_LV'!P:P,\">=\"&$S16,'2. QT_LV'!W:W,\"Không\")\n+COUNTIFS('2. QT_LV'!C:C,\"Đã nghỉ việc\",'2. QT_LV'!O:O,$S16)","v":0},{"$f":"COUNTIFS('2. QT_LV'!$O:$O,\">=\"&S16,'2. QT_LV'!$O:$O,\"<=\"&EOMONTH(S16,0),'2. QT_LV'!$T:$T,\"Tăng mới\")","v":0},{"$f":"COUNTIFS('3.TTNV'!AQ:AQ,\">=\"&S16,'3.TTNV'!AQ:AQ,\"<=\"&EOMONTH(S16,0))","v":0},0,{"$error":"#DIV/0!"},{"$error":"#DIV/0!"},null,8,{"$f":"DATE(RIGHT('5.Dashboard'!$F$4,4),AA16,1)","v":"2020-08-01"},{"$f":"COUNTIFS('2. QT_LV'!$C:$C,\"<>\"&\"Đã nghỉ việc\",'2. QT_LV'!$O:$O,\"<=\"&EOMONTH($AB16,0),'2. QT_LV'!$P:$P,\">=\"&$AB16,'2. QT_LV'!$Z:$Z,AC$8)","v":0},{"$f":"COUNTIFS('2. QT_LV'!$C:$C,\"<>\"&\"Đã nghỉ việc\",'2. QT_LV'!$O:$O,\"<=\"&EOMONTH($AB16,0),'2. QT_LV'!$P:$P,\">=\"&$AB16,'2. QT_LV'!$Z:$Z,AD$8)","v":0},0,null,{"$f":"DATE(RIGHT('5.Dashboard'!$F$4,4),AA16,1)","v":"2020-08-01"},{"$f":"COUNTIFS('2. QT_LV'!$C:$C,\"<>\"&\"Đã nghỉ việc\",'2. QT_LV'!$O:$O,\"<=\"&EOMONTH($AG16,0),'2. QT_LV'!$P:$P,\">=\"&$AG16,'2. QT_LV'!$AA:$AA,AH$8)","v":0},{"$f":"COUNTIFS('2. QT_LV'!$C:$C,\"<>\"&\"Đã nghỉ việc\",'2. QT_LV'!$O:$O,\"<=\"&EOMONTH($AG16,0),'2. QT_LV'!$P:$P,\">=\"&$AG16,'2. QT_LV'!$AA:$AA,AI$8)","v":0},{"$f":"COUNTIFS('2. QT_LV'!$C:$C,\"<>\"&\"Đã nghỉ việc\",'2. QT_LV'!$O:$O,\"<=\"&EOMONTH($AG16,0),'2. QT_LV'!$P:$P,\">=\"&$AG16,'2. QT_LV'!$AA:$AA,AJ$8)","v":0},{"$f":"COUNTIFS('2. QT_LV'!$C:$C,\"<>\"&\"Đã nghỉ việc\",'2. QT_LV'!$O:$O,\"<=\"&EOMONTH($AG16,0),'2. QT_LV'!$P:$P,\">=\"&$AG16,'2. QT_LV'!$AA:$AA,AK$8)","v":0},{"$f":"COUNTIFS('2. QT_LV'!$C:$C,\"<>\"&\"Đã nghỉ việc\",'2. QT_LV'!$O:$O,\"<=\"&EOMONTH($AG16,0),'2. QT_LV'!$P:$P,\">=\"&$AG16,'2. QT_LV'!$AA:$AA,AL$8)","v":0},{"$f":"COUNTIFS('2. QT_LV'!$C:$C,\"<>\"&\"Đã nghỉ việc\",'2. QT_LV'!$O:$O,\"<=\"&EOMONTH($AG16,0),'2. QT_LV'!$P:$P,\">=\"&$AG16,'2. QT_LV'!$AA:$AA,AM$8)","v":0},0,null,8,{"$f":"DATE(IF('5.Dashboard'!$F$4=\"Năm2019\",2019,IF('5.Dashboard'!$F$4=\"Năm2020\",2020)),AP16,1)","v":"2020-08-01"},{"$f":"COUNTIFS('2. QT_LV'!$C:$C,\"<>\"&\"Đã nghỉ việc\",'2. QT_LV'!$O:$O,\"<=\"&EOMONTH($AQ16,0),'2. QT_LV'!$P:$P,\">=\"&$AQ16,'2. QT_LV'!$AB:$AB,AR$8)","v":0},{"$f":"COUNTIFS('2. QT_LV'!$C:$C,\"<>\"&\"Đã nghỉ việc\",'2. QT_LV'!$O:$O,\"<=\"&EOMONTH($AQ16,0),'2. QT_LV'!$P:$P,\">=\"&$AQ16,'2. QT_LV'!$AB:$AB,AS$8)","v":0},{"$f":"COUNTIFS('2. QT_LV'!$C:$C,\"<>\"&\"Đã nghỉ việc\",'2. QT_LV'!$O:$O,\"<=\"&EOMONTH($AQ16,0),'2. QT_LV'!$P:$P,\">=\"&$AQ16,'2. QT_LV'!$AB:$AB,AT$8)","v":0},0]
[null,8,{"$f":"'1. QT_ĐV'!V17","v":"04. Phòng Kinh doanh"},{"$f":"'1. QT_ĐV'!W17","v":"0"},{"$f":"'1. QT_ĐV'!X17","v":"Nhóm Sale"},{"$f":"COUNTIFS('2. QT_LV'!K:K,C17,'2. QT_LV'!L:L,D17,'2. QT_LV'!M:M,E17,'2. QT_LV'!D:D,\"ON\",'2. QT_LV'!C:C,\"<>\"&\"Đã nghỉ việc\",'2. QT_LV'!V:V,\"<>\"&$H$4&\"Thay đổi đơn vị\",'2. QT_LV'!V:V,\"<>\"&$H$4&\"Thay đổi chức danh\",'2. QT_LV'!W:W,\"<>\"&\"Có\")\n+COUNTIFS('2. QT_LV'!K:K,C17,'2. QT_LV'!L:L,D17,'2. QT_LV'!M:M,E17,'2. QT_LV'!G:G,\"ON\",'2. QT_LV'!T:T,\"Thay đổi chức danh\",'2. QT_LV'!O:O,\"=\"&$H$4)\n+COUNTIFS('2. QT_LV'!K:K,C17,'2. QT_LV'!L:L,D17,'2. QT_LV'!M:M,E17,'2. QT_LV'!G:G,\"ON\",'2. QT_LV'!T:T,\"Thay đổi đơn vị\",'2. QT_LV'!O:O,\"=\"&$H$4)\n+COUNTIFS('2. QT_LV'!K:K,C17,'2. QT_LV'!L:L,D17,'2. QT_LV'!M:M,E17,'2. QT_LV'!D:D,\"ON\",'2. QT_LV'!U:U,\"Nghỉ việc\",'2. QT_LV'!O:O,$H$4)","v":0},{"$f":"COUNTIFS('2. QT_LV'!K:K,C17,'2. QT_LV'!L:L,D17,'2. QT_LV'!M:M,E17,'2. QT_LV'!G:G,\"ON\",'2. QT_LV'!T:T,\"Tăng mới\",'2. QT_LV'!O:O,\">=\"&$H$4)","v":0},{"$f":"COUNTIFS('2. QT_LV'!K:K,C17,'2. QT_LV'!L:L,D17,'2. QT_LV'!M:M,E17,'2. QT_LV'!G:G,\"ON\",'2. QT_LV'!T:T,\"Thay đổi chức danh\",'2. QT_LV'!O:O,\">\"&$H$4)\n+COUNTIFS('2. QT_LV'!K:K,C17,'2. QT_LV'!L:L,D17,'2. QT_LV'!M:M,E17,'2. QT_LV'!G:G,\"ON\",'2. QT_LV'!T:T,\"Thay đổi đơn vị\",'2. QT_LV'!O:O,\">\"&$H$4)","v":0},{"$f":"(_xlfn.TEXTJOIN(\"\n\",TRUE,IF(\n(INDIRECT('2. QT_LV'!$K$6)=C17)*\n(INDIRECT('2. QT_LV'!$L$6)=D17)*\n(INDIRECT('2. QT_LV'!$M$6)=E17)*\n(INDIRECT('2. QT_LV'!$G$6)=\"ON\")*\n(INDIRECT('2. QT_LV'!$T$6)=\"Tăng mới\")*\n(INDIRECT('2. QT_LV'!$O$6)>=$H$4)=1,\nINDIRECT('2. QT_LV'!$I$6)&\" \"&INDIRECT('2. QT_LV'!$Q$6),\"\")))","v":""},{"$f":"COUNTIFS('2. QT_LV'!K:K,C17,'2. QT_LV'!L:L,D17,'2. QT_LV'!M:M,E17,'2. QT_LV'!G:G,\"ON\",'2. QT_LV'!U:U,\"Nghỉ việc\",'2. QT_LV'!O:O,\">=\"&$H$4)","v":0},{"$f":"COUNTIFS('2. QT_LV'!K:K,C17,'2. QT_LV'!L:L,D17,'2. QT_LV'!M:M,E17,'2. QT_LV'!G:G,\"ON\",'2. QT_LV'!X:X,\"Có\")","v":0},{"$f":"(_xlfn.TEXTJOIN(\"\n\",TRUE,IF(\n(INDIRECT('2. QT_LV'!$K$6)=C17)*\n(INDIRECT('2. QT_LV'!$L$6)=D17)*\n(INDIRECT('2. QT_LV'!$M$6)=E17)*\n(INDIRECT('2. QT_LV'!$G$6)=\"ON\")*\n(INDIRECT('2. QT_LV'!$U$6)=\"Nghỉ việc\")*\n(INDIRECT('2. QT_LV'!$O$6)>=$H$4)=1,\nINDIRECT('2. QT_LV'!$I$6)&\" \"&INDIRECT('2. QT_LV'!$Q$6),\"\")))","v":""},null,{"$f":"COUNTIFS('2. QT_LV'!K:K,C17,'2. QT_LV'!L:L,D17,'2. QT_LV'!M:M,E17,'2. QT_LV'!E:E,\"ON\",'2. QT_LV'!C:C,\"<>\"&\"Đã nghỉ việc\")","v":0},{"$f":"COUNTIFS(INDIRECT('2. QT_LV'!$K$6),C17,INDIRECT('2. QT_LV'!$L$6),D17,INDIRECT('2. QT_LV'!$M$6),E17,INDIRECT('2. QT_LV'!$G$6),\"ON\",INDIRECT('2. QT_LV'!$C$6),\"Thai sản\")\n+COUNTIFS(INDIRECT('2. QT_LV'!$K$6),C17,INDIRECT('2. QT_LV'!$L$6),D17,INDIRECT('2. QT_LV'!$M$6),E17,INDIRECT('2. QT_LV'!$G$6),\"ON\",INDIRECT('2. QT_LV'!$C$6),\"Không lương\")","v":0},0,null,8,{"$f":"DATE(RIGHT('5.Dashboard'!$F$4,4),R17,1)","v":"2020-08-01"},{"$f":"COUNTIFS('2. QT_LV'!C:C,\"<>\"&\"Đã nghỉ việc\",'2. QT_LV'!O:O,\"<=\"&$S17,'2. QT_LV'!P:P,\">=\"&$S17,'2. QT_LV'!W:W,\"Không\")\n+COUNTIFS('2. QT_LV'!C:C,\"Đã nghỉ việc\",'2. QT_LV'!O:O,$S17)","v":0},{"$f":"COUNTIFS('2. QT_LV'!$O:$O,\">=\"&S17,'2. QT_LV'!$O:$O,\"<=\"&EOMONTH(S17,0),'2. QT_LV'!$T:$T,\"Tăng mới\")","v":0},{"$f":"COUNTIFS('3.TTNV'!AQ:AQ,\">=\"&S17,'3.TTNV'!AQ:AQ,\"<=\"&EOMONTH(S17,0))","v":0},0,{"$error":"#DIV/0!"},{"$error":"#DIV/0!"},null,9,{"$f":"DATE(RIGHT('5.Dashboard'!$F$4,4),AA17,1)","v":"2020-09-01"},{"$f":"COUNTIFS('2. QT_LV'!$C:$C,\"<>\"&\"Đã nghỉ việc\",'2. QT_LV'!$O:$O,\"<=\"&EOMONTH($AB17,0),'2. QT_LV'!$P:$P,\">=\"&$AB17,'2. QT_LV'!$Z:$Z,AC$8)","v":0},{"$f":"COUNTIFS('2. QT_LV'!$C:$C,\"<>\"&\"Đã nghỉ việc\",'2. QT_LV'!$O:$O,\"<=\"&EOMONTH($AB17,0),'2. QT_LV'!$P:$P,\">=\"&$AB17,'2. QT_LV'!$Z:$Z,AD$8)","v":0},0,null,{"$f":"DATE(RIGHT('5.Dashboard'!$F$4,4),AA17,1)","v":"2020-09-01"},{"$f":"COUNTIFS('2. QT_LV'!$C:$C,\"<>\"&\"Đã nghỉ việc\",'2. QT_LV'!$O:$O,\"<=\"&EOMONTH($AG17,0),'2. QT_LV'!$P:$P,\">=\"&$AG17,'2. QT_LV'!$AA:$AA,AH$8)","v":0},{"$f":"COUNTIFS('2. QT_LV'!$C:$C,\"<>\"&\"Đã nghỉ việc\",'2. QT_LV'!$O:$O,\"<=\"&EOMONTH($AG17,0),'2. QT_LV'!$P:$P,\">=\"&$AG17,'2. QT_LV'!$AA:$AA,AI$8)","v":0},{"$f":"COUNTIFS('2. QT_LV'!$C:$C,\"<>\"&\"Đã nghỉ việc\",'2. QT_LV'!$O:$O,\"<=\"&EOMONTH($AG17,0),'2. QT_LV'!$P:$P,\">=\"&$AG17,'2. QT_LV'!$AA:$AA,AJ$8)","v":0},{"$f":"COUNTIFS('2. QT_LV'!$C:$C,\"<>\"&\"Đã nghỉ việc\",'2. QT_LV'!$O:$O,\"<=\"&EOMONTH($AG17,0),'2. QT_LV'!$P:$P,\">=\"&$AG17,'2. QT_LV'!$AA:$AA,AK$8)","v":0},{"$f":"COUNTIFS('2. QT_LV'!$C:$C,\"<>\"&\"Đã nghỉ việc\",'2. QT_LV'!$O:$O,\"<=\"&EOMONTH($AG17,0),'2. QT_LV'!$P:$P,\">=\"&$AG17,'2. QT_LV'!$AA:$AA,AL$8)","v":0},{"$f":"COUNTIFS('2. QT_LV'!$C:$C,\"<>\"&\"Đã nghỉ việc\",'2. QT_LV'!$O:$O,\"<=\"&EOMONTH($AG17,0),'2. QT_LV'!$P:$P,\">=\"&$AG17,'2. QT_LV'!$AA:$AA,AM$8)","v":0},0,null,9,{"$f":"DATE(IF('5.Dashboard'!$F$4=\"Năm2019\",2019,IF('5.Dashboard'!$F$4=\"Năm2020\",2020)),AP17,1)","v":"2020-09-01"},{"$f":"COUNTIFS('2. QT_LV'!$C:$C,\"<>\"&\"Đã nghỉ việc\",'2. QT_LV'!$O:$O,\"<=\"&EOMONTH($AQ17,0),'2. QT_LV'!$P:$P,\">=\"&$AQ17,'2. QT_LV'!$AB:$AB,AR$8)","v":0},{"$f":"COUNTIFS('2. QT_LV'!$C:$C,\"<>\"&\"Đã nghỉ việc\",'2. QT_LV'!$O:$O,\"<=\"&EOMONTH($AQ17,0),'2. QT_LV'!$P:$P,\">=\"&$AQ17,'2. QT_LV'!$AB:$AB,AS$8)","v":0},{"$f":"COUNTIFS('2. QT_LV'!$C:$C,\"<>\"&\"Đã nghỉ việc\",'2. QT_LV'!$O:$O,\"<=\"&EOMONTH($AQ17,0),'2. QT_LV'!$P:$P,\">=\"&$AQ17,'2. QT_LV'!$AB:$AB,AT$8)","v":0},0]
[null,9,{"$f":"'1. QT_ĐV'!V18","v":"04. Phòng Kinh doanh"},{"$f":"'1. QT_ĐV'!W18","v":"0"},{"$f":"'1. QT_ĐV'!X18","v":"Nhóm Sale Admin"},{"$f":"COUNTIFS('2. QT_LV'!K:K,C18,'2. QT_LV'!L:L,D18,'2. QT_LV'!M:M,E18,'2. QT_LV'!D:D,\"ON\",'2. QT_LV'!C:C,\"<>\"&\"Đã nghỉ việc\",'2. QT_LV'!V:V,\"<>\"&$H$4&\"Thay đổi đơn vị\",'2. QT_LV'!V:V,\"<>\"&$H$4&\"Thay đổi chức danh\",'2. QT_LV'!W:W,\"<>\"&\"Có\")\n+COUNTIFS('2. QT_LV'!K:K,C18,'2. QT_LV'!L:L,D18,'2. QT_LV'!M:M,E18,'2. QT_LV'!G:G,\"ON\",'2. QT_LV'!T:T,\"Thay đổi chức danh\",'2. QT_LV'!O:O,\"=\"&$H$4)\n+COUNTIFS('2. QT_LV'!K:K,C18,'2. QT_LV'!L:L,D18,'2. QT_LV'!M:M,E18,'2. QT_LV'!G:G,\"ON\",'2. QT_LV'!T:T,\"Thay đổi đơn vị\",'2. QT_LV'!O:O,\"=\"&$H$4)\n+COUNTIFS('2. QT_LV'!K:K,C18,'2. QT_LV'!L:L,D18,'2. QT_LV'!M:M,E18,'2. QT_LV'!D:D,\"ON\",'2. QT_LV'!U:U,\"Nghỉ việc\",'2. QT_LV'!O:O,$H$4)","v":0},{"$f":"COUNTIFS('2. QT_LV'!K:K,C18,'2. QT_LV'!L:L,D18,'2. QT_LV'!M:M,E18,'2. QT_LV'!G:G,\"ON\",'2. QT_LV'!T:T,\"Tăng mới\",'2. QT_LV'!O:O,\">=\"&$H$4)","v":0},{"$f":"COUNTIFS('2. QT_LV'!K:K,C18,'2. QT_LV'!L:L,D18,'2. QT_LV'!M:M,E18,'2. QT_LV'!G:G,\"ON\",'2. QT_LV'!T:T,\"Thay đổi chức danh\",'2. QT_LV'!O:O,\">\"&$H$4)\n+COUNTIFS('2. QT_LV'!K:K,C18,'2. QT_LV'!L:L,D18,'2. QT_LV'!M:M,E18,'2. QT_LV'!G:G,\"ON\",'2. QT_LV'!T:T,\"Thay đổi đơn vị\",'2. QT_LV'!O:O,\">\"&$H$4)","v":0},{"$f":"(_xlfn.TEXTJOIN(\"\n\",TRUE,IF(\n(INDIRECT('2. QT_LV'!$K$6)=C18)*\n(INDIRECT('2. QT_LV'!$L$6)=D18)*\n(INDIRECT('2. QT_LV'!$M$6)=E18)*\n(INDIRECT('2. QT_LV'!$G$6)=\"ON\")*\n(INDIRECT('2. QT_LV'!$T$6)=\"Tăng mới\")*\n(INDIRECT('2. QT_LV'!$O$6)>=$H$4)=1,\nINDIRECT('2. QT_LV'!$I$6)&\" \"&INDIRECT('2. QT_LV'!$Q$6),\"\")))","v":""},{"$f":"COUNTIFS('2. QT_LV'!K:K,C18,'2. QT_LV'!L:L,D18,'2. QT_LV'!M:M,E18,'2. QT_LV'!G:G,\"ON\",'2. QT_LV'!U:U,\"Nghỉ việc\",'2. QT_LV'!O:O,\">=\"&$H$4)","v":0},{"$f":"COUNTIFS('2. QT_LV'!K:K,C18,'2. QT_LV'!L:L,D18,'2. QT_LV'!M:M,E18,'2. QT_LV'!G:G,\"ON\",'2. QT_LV'!X:X,\"Có\")","v":0},{"$f":"(_xlfn.TEXTJOIN(\"\n\",TRUE,IF(\n(INDIRECT('2. QT_LV'!$K$6)=C18)*\n(INDIRECT('2. QT_LV'!$L$6)=D18)*\n(INDIRECT('2. QT_LV'!$M$6)=E18)*\n(INDIRECT('2. QT_LV'!$G$6)=\"ON\")*\n(INDIRECT('2. QT_LV'!$U$6)=\"Nghỉ việc\")*\n(INDIRECT('2. QT_LV'!$O$6)>=$H$4)=1,\nINDIRECT('2. QT_LV'!$I$6)&\" \"&INDIRECT('2. QT_LV'!$Q$6),\"\")))","v":""},null,{"$f":"COUNTIFS('2. QT_LV'!K:K,C18,'2. QT_LV'!L:L,D18,'2. QT_LV'!M:M,E18,'2. QT_LV'!E:E,\"ON\",'2. QT_LV'!C:C,\"<>\"&\"Đã nghỉ việc\")","v":0},{"$f":"COUNTIFS(INDIRECT('2. QT_LV'!$K$6),C18,INDIRECT('2. QT_LV'!$L$6),D18,INDIRECT('2. QT_LV'!$M$6),E18,INDIRECT('2. QT_LV'!$G$6),\"ON\",INDIRECT('2. QT_LV'!$C$6),\"Thai sản\")\n+COUNTIFS(INDIRECT('2. QT_LV'!$K$6),C18,INDIRECT('2. QT_LV'!$L$6),D18,INDIRECT('2. QT_LV'!$M$6),E18,INDIRECT('2. QT_LV'!$G$6),\"ON\",INDIRECT('2. QT_LV'!$C$6),\"Không lương\")","v":0},0,null,9,{"$f":"DATE(RIGHT('5.Dashboard'!$F$4,4),R18,1)","v":"2020-09-01"},{"$f":"COUNTIFS('2. QT_LV'!C:C,\"<>\"&\"Đã nghỉ việc\",'2. QT_LV'!O:O,\"<=\"&$S18,'2. QT_LV'!P:P,\">=\"&$S18,'2. QT_LV'!W:W,\"Không\")\n+COUNTIFS('2. QT_LV'!C:C,\"Đã nghỉ việc\",'2. QT_LV'!O:O,$S18)","v":0},{"$f":"COUNTIFS('2. QT_LV'!$O:$O,\">=\"&S18,'2. QT_LV'!$O:$O,\"<=\"&EOMONTH(S18,0),'2. QT_LV'!$T:$T,\"Tăng mới\")","v":0},{"$f":"COUNTIFS('3.TTNV'!AQ:AQ,\">=\"&S18,'3.TTNV'!AQ:AQ,\"<=\"&EOMONTH(S18,0))","v":0},0,{"$error":"#DIV/0!"},{"$error":"#DIV/0!"},null,10,{"$f":"DATE(RIGHT('5.Dashboard'!$F$4,4),AA18,1)","v":"2020-10-01"},{"$f":"COUNTIFS('2. QT_LV'!$C:$C,\"<>\"&\"Đã nghỉ việc\",'2. QT_LV'!$O:$O,\"<=\"&EOMONTH($AB18,0),'2. QT_LV'!$P:$P,\">=\"&$AB18,'2. QT_LV'!$Z:$Z,AC$8)","v":0},{"$f":"COUNTIFS('2. QT_LV'!$C:$C,\"<>\"&\"Đã nghỉ việc\",'2. QT_LV'!$O:$O,\"<=\"&EOMONTH($AB18,0),'2. QT_LV'!$P:$P,\">=\"&$AB18,'2. QT_LV'!$Z:$Z,AD$8)","v":0},0,null,{"$f":"DATE(RIGHT('5.Dashboard'!$F$4,4),AA18,1)","v":"2020-10-01"},{"$f":"COUNTIFS('2. QT_LV'!$C:$C,\"<>\"&\"Đã nghỉ việc\",'2. QT_LV'!$O:$O,\"<=\"&EOMONTH($AG18,0),'2. QT_LV'!$P:$P,\">=\"&$AG18,'2. QT_LV'!$AA:$AA,AH$8)","v":0},{"$f":"COUNTIFS('2. QT_LV'!$C:$C,\"<>\"&\"Đã nghỉ việc\",'2. QT_LV'!$O:$O,\"<=\"&EOMONTH($AG18,0),'2. QT_LV'!$P:$P,\">=\"&$AG18,'2. QT_LV'!$AA:$AA,AI$8)","v":0},{"$f":"COUNTIFS('2. QT_LV'!$C:$C,\"<>\"&\"Đã nghỉ việc\",'2. QT_LV'!$O:$O,\"<=\"&EOMONTH($AG18,0),'2. QT_LV'!$P:$P,\">=\"&$AG18,'2. QT_LV'!$AA:$AA,AJ$8)","v":0},{"$f":"COUNTIFS('2. QT_LV'!$C:$C,\"<>\"&\"Đã nghỉ việc\",'2. QT_LV'!$O:$O,\"<=\"&EOMONTH($AG18,0),'2. QT_LV'!$P:$P,\">=\"&$AG18,'2. QT_LV'!$AA:$AA,AK$8)","v":0},{"$f":"COUNTIFS('2. QT_LV'!$C:$C,\"<>\"&\"Đã nghỉ việc\",'2. QT_LV'!$O:$O,\"<=\"&EOMONTH($AG18,0),'2. QT_LV'!$P:$P,\">=\"&$AG18,'2. QT_LV'!$AA:$AA,AL$8)","v":0},{"$f":"COUNTIFS('2. QT_LV'!$C:$C,\"<>\"&\"Đã nghỉ việc\",'2. QT_LV'!$O:$O,\"<=\"&EOMONTH($AG18,0),'2. QT_LV'!$P:$P,\">=\"&$AG18,'2. QT_LV'!$AA:$AA,AM$8)","v":0},0,null,10,{"$f":"DATE(IF('5.Dashboard'!$F$4=\"Năm2019\",2019,IF('5.Dashboard'!$F$4=\"Năm2020\",2020)),AP18,1)","v":"2020-10-01"},{"$f":"COUNTIFS('2. QT_LV'!$C:$C,\"<>\"&\"Đã nghỉ việc\",'2. QT_LV'!$O:$O,\"<=\"&EOMONTH($AQ18,0),'2. QT_LV'!$P:$P,\">=\"&$AQ18,'2. QT_LV'!$AB:$AB,AR$8)","v":0},{"$f":"COUNTIFS('2. QT_LV'!$C:$C,\"<>\"&\"Đã nghỉ việc\",'2. QT_LV'!$O:$O,\"<=\"&EOMONTH($AQ18,0),'2. QT_LV'!$P:$P,\">=\"&$AQ18,'2. QT_LV'!$AB:$AB,AS$8)","v":0},{"$f":"COUNTIFS('2. QT_LV'!$C:$C,\"<>\"&\"Đã nghỉ việc\",'2. QT_LV'!$O:$O,\"<=\"&EOMONTH($AQ18,0),'2. QT_LV'!$P:$P,\">=\"&$AQ18,'2. QT_LV'!$AB:$AB,AT$8)","v":0},0]
[null,10,{"$f":"'1. QT_ĐV'!V19","v":"04. Phòng Marketing"},{"$f":"'1. QT_ĐV'!W19","v":"0"},{"$f":"'1. QT_ĐV'!X19","v":"0"},{"$f":"COUNTIFS('2. QT_LV'!K:K,C19,'2. QT_LV'!L:L,D19,'2. QT_LV'!M:M,E19,'2. QT_LV'!D:D,\"ON\",'2. QT_LV'!C:C,\"<>\"&\"Đã nghỉ việc\",'2. QT_LV'!V:V,\"<>\"&$H$4&\"Thay đổi đơn vị\",'2. QT_LV'!V:V,\"<>\"&$H$4&\"Thay đổi chức danh\",'2. QT_LV'!W:W,\"<>\"&\"Có\")\n+COUNTIFS('2. QT_LV'!K:K,C19,'2. QT_LV'!L:L,D19,'2. QT_LV'!M:M,E19,'2. QT_LV'!G:G,\"ON\",'2. QT_LV'!T:T,\"Thay đổi chức danh\",'2. QT_LV'!O:O,\"=\"&$H$4)\n+COUNTIFS('2. QT_LV'!K:K,C19,'2. QT_LV'!L:L,D19,'2. QT_LV'!M:M,E19,'2. QT_LV'!G:G,\"ON\",'2. QT_LV'!T:T,\"Thay đổi đơn vị\",'2. QT_LV'!O:O,\"=\"&$H$4)\n+COUNTIFS('2. QT_LV'!K:K,C19,'2. QT_LV'!L:L,D19,'2. QT_LV'!M:M,E19,'2. QT_LV'!D:D,\"ON\",'2. QT_LV'!U:U,\"Nghỉ việc\",'2. QT_LV'!O:O,$H$4)","v":0},{"$f":"COUNTIFS('2. QT_LV'!K:K,C19,'2. QT_LV'!L:L,D19,'2. QT_LV'!M:M,E19,'2. QT_LV'!G:G,\"ON\",'2. QT_LV'!T:T,\"Tăng mới\",'2. QT_LV'!O:O,\">=\"&$H$4)","v":0},{"$f":"COUNTIFS('2. QT_LV'!K:K,C19,'2. QT_LV'!L:L,D19,'2. QT_LV'!M:M,E19,'2. QT_LV'!G:G,\"ON\",'2. QT_LV'!T:T,\"Thay đổi chức danh\",'2. QT_LV'!O:O,\">\"&$H$4)\n+COUNTIFS('2. QT_LV'!K:K,C19,'2. QT_LV'!L:L,D19,'2. QT_LV'!M:M,E19,'2. QT_LV'!G:G,\"ON\",'2. QT_LV'!T:T,\"Thay đổi đơn vị\",'2. QT_LV'!O:O,\">\"&$H$4)","v":0},{"$f":"(_xlfn.TEXTJOIN(\"\n\",TRUE,IF(\n(INDIRECT('2. QT_LV'!$K$6)=C19)*\n(INDIRECT('2. QT_LV'!$L$6)=D19)*\n(INDIRECT('2. QT_LV'!$M$6)=E19)*\n(INDIRECT('2. QT_LV'!$G$6)=\"ON\")*\n(INDIRECT('2. QT_LV'!$T$6)=\"Tăng mới\")*\n(INDIRECT('2. QT_LV'!$O$6)>=$H$4)=1,\nINDIRECT('2. QT_LV'!$I$6)&\" \"&INDIRECT('2. QT_LV'!$Q$6),\"\")))","v":""},{"$f":"COUNTIFS('2. QT_LV'!K:K,C19,'2. QT_LV'!L:L,D19,'2. QT_LV'!M:M,E19,'2. QT_LV'!G:G,\"ON\",'2. QT_LV'!U:U,\"Nghỉ việc\",'2. QT_LV'!O:O,\">=\"&$H$4)","v":0},{"$f":"COUNTIFS('2. QT_LV'!K:K,C19,'2. QT_LV'!L:L,D19,'2. QT_LV'!M:M,E19,'2. QT_LV'!G:G,\"ON\",'2. QT_LV'!X:X,\"Có\")","v":0},{"$f":"(_xlfn.TEXTJOIN(\"\n\",TRUE,IF(\n(INDIRECT('2. QT_LV'!$K$6)=C19)*\n(INDIRECT('2. QT_LV'!$L$6)=D19)*\n(INDIRECT('2. QT_LV'!$M$6)=E19)*\n(INDIRECT('2. QT_LV'!$G$6)=\"ON\")*\n(INDIRECT('2. QT_LV'!$U$6)=\"Nghỉ việc\")*\n(INDIRECT('2. QT_LV'!$O$6)>=$H$4)=1,\nINDIRECT('2. QT_LV'!$I$6)&\" \"&INDIRECT('2. QT_LV'!$Q$6),\"\")))","v":""},null,{"$f":"COUNTIFS('2. QT_LV'!K:K,C19,'2. QT_LV'!L:L,D19,'2. QT_LV'!M:M,E19,'2. QT_LV'!E:E,\"ON\",'2. QT_LV'!C:C,\"<>\"&\"Đã nghỉ việc\")","v":0},{"$f":"COUNTIFS(INDIRECT('2. QT_LV'!$K$6),C19,INDIRECT('2. QT_LV'!$L$6),D19,INDIRECT('2. QT_LV'!$M$6),E19,INDIRECT('2. QT_LV'!$G$6),\"ON\",INDIRECT('2. QT_LV'!$C$6),\"Thai sản\")\n+COUNTIFS(INDIRECT('2. QT_LV'!$K$6),C19,INDIRECT('2. QT_LV'!$L$6),D19,INDIRECT('2. QT_LV'!$M$6),E19,INDIRECT('2. QT_LV'!$G$6),\"ON\",INDIRECT('2. QT_LV'!$C$6),\"Không lương\")","v":0},0,null,10,{"$f":"DATE(RIGHT('5.Dashboard'!$F$4,4),R19,1)","v":"2020-10-01"},{"$f":"COUNTIFS('2. QT_LV'!C:C,\"<>\"&\"Đã nghỉ việc\",'2. QT_LV'!O:O,\"<=\"&$S19,'2. QT_LV'!P:P,\">=\"&$S19,'2. QT_LV'!W:W,\"Không\")\n+COUNTIFS('2. QT_LV'!C:C,\"Đã nghỉ việc\",'2. QT_LV'!O:O,$S19)","v":0},{"$f":"COUNTIFS('2. QT_LV'!$O:$O,\">=\"&S19,'2. QT_LV'!$O:$O,\"<=\"&EOMONTH(S19,0),'2. QT_LV'!$T:$T,\"Tăng mới\")","v":0},{"$f":"COUNTIFS('3.TTNV'!AQ:AQ,\">=\"&S19,'3.TTNV'!AQ:AQ,\"<=\"&EOMONTH(S19,0))","v":0},0,{"$error":"#DIV/0!"},{"$error":"#DIV/0!"},null,11,{"$f":"DATE(RIGHT('5.Dashboard'!$F$4,4),AA19,1)","v":"2020-11-01"},{"$f":"COUNTIFS('2. QT_LV'!$C:$C,\"<>\"&\"Đã nghỉ việc\",'2. QT_LV'!$O:$O,\"<=\"&EOMONTH($AB19,0),'2. QT_LV'!$P:$P,\">=\"&$AB19,'2. QT_LV'!$Z:$Z,AC$8)","v":0},{"$f":"COUNTIFS('2. QT_LV'!$C:$C,\"<>\"&\"Đã nghỉ việc\",'2. QT_LV'!$O:$O,\"<=\"&EOMONTH($AB19,0),'2. QT_LV'!$P:$P,\">=\"&$AB19,'2. QT_LV'!$Z:$Z,AD$8)","v":0},0,null,{"$f":"DATE(RIGHT('5.Dashboard'!$F$4,4),AA19,1)","v":"2020-11-01"},{"$f":"COUNTIFS('2. QT_LV'!$C:$C,\"<>\"&\"Đã nghỉ việc\",'2. QT_LV'!$O:$O,\"<=\"&EOMONTH($AG19,0),'2. QT_LV'!$P:$P,\">=\"&$AG19,'2. QT_LV'!$AA:$AA,AH$8)","v":0},{"$f":"COUNTIFS('2. QT_LV'!$C:$C,\"<>\"&\"Đã nghỉ việc\",'2. QT_LV'!$O:$O,\"<=\"&EOMONTH($AG19,0),'2. QT_LV'!$P:$P,\">=\"&$AG19,'2. QT_LV'!$AA:$AA,AI$8)","v":0},{"$f":"COUNTIFS('2. QT_LV'!$C:$C,\"<>\"&\"Đã nghỉ việc\",'2. QT_LV'!$O:$O,\"<=\"&EOMONTH($AG19,0),'2. QT_LV'!$P:$P,\">=\"&$AG19,'2. QT_LV'!$AA:$AA,AJ$8)","v":0},{"$f":"COUNTIFS('2. QT_LV'!$C:$C,\"<>\"&\"Đã nghỉ việc\",'2. QT_LV'!$O:$O,\"<=\"&EOMONTH($AG19,0),'2. QT_LV'!$P:$P,\">=\"&$AG19,'2. QT_LV'!$AA:$AA,AK$8)","v":0},{"$f":"COUNTIFS('2. QT_LV'!$C:$C,\"<>\"&\"Đã nghỉ việc\",'2. QT_LV'!$O:$O,\"<=\"&EOMONTH($AG19,0),'2. QT_LV'!$P:$P,\">=\"&$AG19,'2. QT_LV'!$AA:$AA,AL$8)","v":0},{"$f":"COUNTIFS('2. QT_LV'!$C:$C,\"<>\"&\"Đã nghỉ việc\",'2. QT_LV'!$O:$O,\"<=\"&EOMONTH($AG19,0),'2. QT_LV'!$P:$P,\">=\"&$AG19,'2. QT_LV'!$AA:$AA,AM$8)","v":0},0,null,11,{"$f":"DATE(IF('5.Dashboard'!$F$4=\"Năm2019\",2019,IF('5.Dashboard'!$F$4=\"Năm2020\",2020)),AP19,1)","v":"2020-11-01"},{"$f":"COUNTIFS('2. QT_LV'!$C:$C,\"<>\"&\"Đã nghỉ việc\",'2. QT_LV'!$O:$O,\"<=\"&EOMONTH($AQ19,0),'2. QT_LV'!$P:$P,\">=\"&$AQ19,'2. QT_LV'!$AB:$AB,AR$8)","v":0},{"$f":"COUNTIFS('2. QT_LV'!$C:$C,\"<>\"&\"Đã nghỉ việc\",'2. QT_LV'!$O:$O,\"<=\"&EOMONTH($AQ19,0),'2. QT_LV'!$P:$P,\">=\"&$AQ19,'2. QT_LV'!$AB:$AB,AS$8)","v":0},{"$f":"COUNTIFS('2. QT_LV'!$C:$C,\"<>\"&\"Đã nghỉ việc\",'2. QT_LV'!$O:$O,\"<=\"&EOMONTH($AQ19,0),'2. QT_LV'!$P:$P,\">=\"&$AQ19,'2. QT_LV'!$AB:$AB,AT$8)","v":0},0]
[null,11,{"$f":"'1. QT_ĐV'!V20","v":"04. Phòng Marketing"},{"$f":"'1. QT_ĐV'!W20","v":"0"},{"$f":"'1. QT_ĐV'!X20","v":"Nhóm Ads"},{"$f":"COUNTIFS('2. QT_LV'!K:K,C20,'2. QT_LV'!L:L,D20,'2. QT_LV'!M:M,E20,'2. QT_LV'!D:D,\"ON\",'2. QT_LV'!C:C,\"<>\"&\"Đã nghỉ việc\",'2. QT_LV'!V:V,\"<>\"&$H$4&\"Thay đổi đơn vị\",'2. QT_LV'!V:V,\"<>\"&$H$4&\"Thay đổi chức danh\",'2. QT_LV'!W:W,\"<>\"&\"Có\")\n+COUNTIFS('2. QT_LV'!K:K,C20,'2. QT_LV'!L:L,D20,'2. QT_LV'!M:M,E20,'2. QT_LV'!G:G,\"ON\",'2. QT_LV'!T:T,\"Thay đổi chức danh\",'2. QT_LV'!O:O,\"=\"&$H$4)\n+COUNTIFS('2. QT_LV'!K:K,C20,'2. QT_LV'!L:L,D20,'2. QT_LV'!M:M,E20,'2. QT_LV'!G:G,\"ON\",'2. QT_LV'!T:T,\"Thay đổi đơn vị\",'2. QT_LV'!O:O,\"=\"&$H$4)\n+COUNTIFS('2. QT_LV'!K:K,C20,'2. QT_LV'!L:L,D20,'2. QT_LV'!M:M,E20,'2. QT_LV'!D:D,\"ON\",'2. QT_LV'!U:U,\"Nghỉ việc\",'2. QT_LV'!O:O,$H$4)","v":0},{"$f":"COUNTIFS('2. QT_LV'!K:K,C20,'2. QT_LV'!L:L,D20,'2. QT_LV'!M:M,E20,'2. QT_LV'!G:G,\"ON\",'2. QT_LV'!T:T,\"Tăng mới\",'2. QT_LV'!O:O,\">=\"&$H$4)","v":0},{"$f":"COUNTIFS('2. QT_LV'!K:K,C20,'2. QT_LV'!L:L,D20,'2. QT_LV'!M:M,E20,'2. QT_LV'!G:G,\"ON\",'2. QT_LV'!T:T,\"Thay đổi chức danh\",'2. QT_LV'!O:O,\">\"&$H$4)\n+COUNTIFS('2. QT_LV'!K:K,C20,'2. QT_LV'!L:L,D20,'2. QT_LV'!M:M,E20,'2. QT_LV'!G:G,\"ON\",'2. QT_LV'!T:T,\"Thay đổi đơn vị\",'2. QT_LV'!O:O,\">\"&$H$4)","v":0},{"$f":"(_xlfn.TEXTJOIN(\"\n\",TRUE,IF(\n(INDIRECT('2. QT_LV'!$K$6)=C20)*\n(INDIRECT('2. QT_LV'!$L$6)=D20)*\n(INDIRECT('2. QT_LV'!$M$6)=E20)*\n(INDIRECT('2. QT_LV'!$G$6)=\"ON\")*\n(INDIRECT('2. QT_LV'!$T$6)=\"Tăng mới\")*\n(INDIRECT('2. QT_LV'!$O$6)>=$H$4)=1,\nINDIRECT('2. QT_LV'!$I$6)&\" \"&INDIRECT('2. QT_LV'!$Q$6),\"\")))","v":""},{"$f":"COUNTIFS('2. QT_LV'!K:K,C20,'2. QT_LV'!L:L,D20,'2. QT_LV'!M:M,E20,'2. QT_LV'!G:G,\"ON\",'2. QT_LV'!U:U,\"Nghỉ việc\",'2. QT_LV'!O:O,\">=\"&$H$4)","v":0},{"$f":"COUNTIFS('2. QT_LV'!K:K,C20,'2. QT_LV'!L:L,D20,'2. QT_LV'!M:M,E20,'2. QT_LV'!G:G,\"ON\",'2. QT_LV'!X:X,\"Có\")","v":0},{"$f":"(_xlfn.TEXTJOIN(\"\n\",TRUE,IF(\n(INDIRECT('2. QT_LV'!$K$6)=C20)*\n(INDIRECT('2. QT_LV'!$L$6)=D20)*\n(INDIRECT('2. QT_LV'!$M$6)=E20)*\n(INDIRECT('2. QT_LV'!$G$6)=\"ON\")*\n(INDIRECT('2. QT_LV'!$U$6)=\"Nghỉ việc\")*\n(INDIRECT('2. QT_LV'!$O$6)>=$H$4)=1,\nINDIRECT('2. QT_LV'!$I$6)&\" \"&INDIRECT('2. QT_LV'!$Q$6),\"\")))","v":""},null,{"$f":"COUNTIFS('2. QT_LV'!K:K,C20,'2. QT_LV'!L:L,D20,'2. QT_LV'!M:M,E20,'2. QT_LV'!E:E,\"ON\",'2. QT_LV'!C:C,\"<>\"&\"Đã nghỉ việc\")","v":0},{"$f":"COUNTIFS(INDIRECT('2. QT_LV'!$K$6),C20,INDIRECT('2. QT_LV'!$L$6),D20,INDIRECT('2. QT_LV'!$M$6),E20,INDIRECT('2. QT_LV'!$G$6),\"ON\",INDIRECT('2. QT_LV'!$C$6),\"Thai sản\")\n+COUNTIFS(INDIRECT('2. QT_LV'!$K$6),C20,INDIRECT('2. QT_LV'!$L$6),D20,INDIRECT('2. QT_LV'!$M$6),E20,INDIRECT('2. QT_LV'!$G$6),\"ON\",INDIRECT('2. QT_LV'!$C$6),\"Không lương\")","v":0},0,null,11,{"$f":"DATE(RIGHT('5.Dashboard'!$F$4,4),R20,1)","v":"2020-11-01"},{"$f":"COUNTIFS('2. QT_LV'!C:C,\"<>\"&\"Đã nghỉ việc\",'2. QT_LV'!O:O,\"<=\"&$S20,'2. QT_LV'!P:P,\">=\"&$S20,'2. QT_LV'!W:W,\"Không\")\n+COUNTIFS('2. QT_LV'!C:C,\"Đã nghỉ việc\",'2. QT_LV'!O:O,$S20)","v":0},{"$f":"COUNTIFS('2. QT_LV'!$O:$O,\">=\"&S20,'2. QT_LV'!$O:$O,\"<=\"&EOMONTH(S20,0),'2. QT_LV'!$T:$T,\"Tăng mới\")","v":0},{"$f":"COUNTIFS('3.TTNV'!AQ:AQ,\">=\"&S20,'3.TTNV'!AQ:AQ,\"<=\"&EOMONTH(S20,0))","v":0},0,{"$error":"#DIV/0!"},{"$error":"#DIV/0!"},null,12,{"$f":"DATE(RIGHT('5.Dashboard'!$F$4,4),AA20,1)","v":"2020-12-01"},{"$f":"COUNTIFS('2. QT_LV'!$C:$C,\"<>\"&\"Đã nghỉ việc\",'2. QT_LV'!$O:$O,\"<=\"&EOMONTH($AB20,0),'2. QT_LV'!$P:$P,\">=\"&$AB20,'2. QT_LV'!$Z:$Z,AC$8)","v":0},{"$f":"COUNTIFS('2. QT_LV'!$C:$C,\"<>\"&\"Đã nghỉ việc\",'2. QT_LV'!$O:$O,\"<=\"&EOMONTH($AB20,0),'2. QT_LV'!$P:$P,\">=\"&$AB20,'2. QT_LV'!$Z:$Z,AD$8)","v":0},0,null,{"$f":"DATE(RIGHT('5.Dashboard'!$F$4,4),AA20,1)","v":"2020-12-01"},{"$f":"COUNTIFS('2. QT_LV'!$C:$C,\"<>\"&\"Đã nghỉ việc\",'2. QT_LV'!$O:$O,\"<=\"&EOMONTH($AG20,0),'2. QT_LV'!$P:$P,\">=\"&$AG20,'2. QT_LV'!$AA:$AA,AH$8)","v":0},{"$f":"COUNTIFS('2. QT_LV'!$C:$C,\"<>\"&\"Đã nghỉ việc\",'2. QT_LV'!$O:$O,\"<=\"&EOMONTH($AG20,0),'2. QT_LV'!$P:$P,\">=\"&$AG20,'2. QT_LV'!$AA:$AA,AI$8)","v":0},{"$f":"COUNTIFS('2. QT_LV'!$C:$C,\"<>\"&\"Đã nghỉ việc\",'2. QT_LV'!$O:$O,\"<=\"&EOMONTH($AG20,0),'2. QT_LV'!$P:$P,\">=\"&$AG20,'2. QT_LV'!$AA:$AA,AJ$8)","v":0},{"$f":"COUNTIFS('2. QT_LV'!$C:$C,\"<>\"&\"Đã nghỉ việc\",'2. QT_LV'!$O:$O,\"<=\"&EOMONTH($AG20,0),'2. QT_LV'!$P:$P,\">=\"&$AG20,'2. QT_LV'!$AA:$AA,AK$8)","v":0},{"$f":"COUNTIFS('2. QT_LV'!$C:$C,\"<>\"&\"Đã nghỉ việc\",'2. QT_LV'!$O:$O,\"<=\"&EOMONTH($AG20,0),'2. QT_LV'!$P:$P,\">=\"&$AG20,'2. QT_LV'!$AA:$AA,AL$8)","v":0},{"$f":"COUNTIFS('2. QT_LV'!$C:$C,\"<>\"&\"Đã nghỉ việc\",'2. QT_LV'!$O:$O,\"<=\"&EOMONTH($AG20,0),'2. QT_LV'!$P:$P,\">=\"&$AG20,'2. QT_LV'!$AA:$AA,AM$8)","v":0},0,null,12,{"$f":"DATE(IF('5.Dashboard'!$F$4=\"Năm2019\",2019,IF('5.Dashboard'!$F$4=\"Năm2020\",2020)),AP20,1)","v":"2020-12-01"},{"$f":"COUNTIFS('2. QT_LV'!$C:$C,\"<>\"&\"Đã nghỉ việc\",'2. QT_LV'!$O:$O,\"<=\"&EOMONTH($AQ20,0),'2. QT_LV'!$P:$P,\">=\"&$AQ20,'2. QT_LV'!$AB:$AB,AR$8)","v":0},{"$f":"COUNTIFS('2. QT_LV'!$C:$C,\"<>\"&\"Đã nghỉ việc\",'2. QT_LV'!$O:$O,\"<=\"&EOMONTH($AQ20,0),'2. QT_LV'!$P:$P,\">=\"&$AQ20,'2. QT_LV'!$AB:$AB,AS$8)","v":0},{"$f":"COUNTIFS('2. QT_LV'!$C:$C,\"<>\"&\"Đã nghỉ việc\",'2. QT_LV'!$O:$O,\"<=\"&EOMONTH($AQ20,0),'2. QT_LV'!$P:$P,\">=\"&$AQ20,'2. QT_LV'!$AB:$AB,AT$8)","v":0},0]
[null,12,{"$f":"'1. QT_ĐV'!V21","v":"04. Phòng Marketing"},{"$f":"'1. QT_ĐV'!W21","v":"0"},{"$f":"'1. QT_ĐV'!X21","v":"Nhóm Kênh"},{"$f":"COUNTIFS('2. QT_LV'!K:K,C21,'2. QT_LV'!L:L,D21,'2. QT_LV'!M:M,E21,'2. QT_LV'!D:D,\"ON\",'2. QT_LV'!C:C,\"<>\"&\"Đã nghỉ việc\",'2. QT_LV'!V:V,\"<>\"&$H$4&\"Thay đổi đơn vị\",'2. QT_LV'!V:V,\"<>\"&$H$4&\"Thay đổi chức danh\",'2. QT_LV'!W:W,\"<>\"&\"Có\")\n+COUNTIFS('2. QT_LV'!K:K,C21,'2. QT_LV'!L:L,D21,'2. QT_LV'!M:M,E21,'2. QT_LV'!G:G,\"ON\",'2. QT_LV'!T:T,\"Thay đổi chức danh\",'2. QT_LV'!O:O,\"=\"&$H$4)\n+COUNTIFS('2. QT_LV'!K:K,C21,'2. QT_LV'!L:L,D21,'2. QT_LV'!M:M,E21,'2. QT_LV'!G:G,\"ON\",'2. QT_LV'!T:T,\"Thay đổi đơn vị\",'2. QT_LV'!O:O,\"=\"&$H$4)\n+COUNTIFS('2. QT_LV'!K:K,C21,'2. QT_LV'!L:L,D21,'2. QT_LV'!M:M,E21,'2. QT_LV'!D:D,\"ON\",'2. QT_LV'!U:U,\"Nghỉ việc\",'2. QT_LV'!O:O,$H$4)","v":0},{"$f":"COUNTIFS('2. QT_LV'!K:K,C21,'2. QT_LV'!L:L,D21,'2. QT_LV'!M:M,E21,'2. QT_LV'!G:G,\"ON\",'2. QT_LV'!T:T,\"Tăng mới\",'2. QT_LV'!O:O,\">=\"&$H$4)","v":0},{"$f":"COUNTIFS('2. QT_LV'!K:K,C21,'2. QT_LV'!L:L,D21,'2. QT_LV'!M:M,E21,'2. QT_LV'!G:G,\"ON\",'2. QT_LV'!T:T,\"Thay đổi chức danh\",'2. QT_LV'!O:O,\">\"&$H$4)\n+COUNTIFS('2. QT_LV'!K:K,C21,'2. QT_LV'!L:L,D21,'2. QT_LV'!M:M,E21,'2. QT_LV'!G:G,\"ON\",'2. QT_LV'!T:T,\"Thay đổi đơn vị\",'2. QT_LV'!O:O,\">\"&$H$4)","v":0},{"$f":"(_xlfn.TEXTJOIN(\"\n\",TRUE,IF(\n(INDIRECT('2. QT_LV'!$K$6)=C21)*\n(INDIRECT('2. QT_LV'!$L$6)=D21)*\n(INDIRECT('2. QT_LV'!$M$6)=E21)*\n(INDIRECT('2. QT_LV'!$G$6)=\"ON\")*\n(INDIRECT('2. QT_LV'!$T$6)=\"Tăng mới\")*\n(INDIRECT('2. QT_LV'!$O$6)>=$H$4)=1,\nINDIRECT('2. QT_LV'!$I$6)&\" \"&INDIRECT('2. QT_LV'!$Q$6),\"\")))","v":""},{"$f":"COUNTIFS('2. QT_LV'!K:K,C21,'2. QT_LV'!L:L,D21,'2. QT_LV'!M:M,E21,'2. QT_LV'!G:G,\"ON\",'2. QT_LV'!U:U,\"Nghỉ việc\",'2. QT_LV'!O:O,\">=\"&$H$4)","v":0},{"$f":"COUNTIFS('2. QT_LV'!K:K,C21,'2. QT_LV'!L:L,D21,'2. QT_LV'!M:M,E21,'2. QT_LV'!G:G,\"ON\",'2. QT_LV'!X:X,\"Có\")","v":0},{"$f":"(_xlfn.TEXTJOIN(\"\n\",TRUE,IF(\n(INDIRECT('2. QT_LV'!$K$6)=C21)*\n(INDIRECT('2. QT_LV'!$L$6)=D21)*\n(INDIRECT('2. QT_LV'!$M$6)=E21)*\n(INDIRECT('2. QT_LV'!$G$6)=\"ON\")*\n(INDIRECT('2. QT_LV'!$U$6)=\"Nghỉ việc\")*\n(INDIRECT('2. QT_LV'!$O$6)>=$H$4)=1,\nINDIRECT('2. QT_LV'!$I$6)&\" \"&INDIRECT('2. QT_LV'!$Q$6),\"\")))","v":""},null,{"$f":"COUNTIFS('2. QT_LV'!K:K,C21,'2. QT_LV'!L:L,D21,'2. QT_LV'!M:M,E21,'2. QT_LV'!E:E,\"ON\",'2. QT_LV'!C:C,\"<>\"&\"Đã nghỉ việc\")","v":0},{"$f":"COUNTIFS(INDIRECT('2. QT_LV'!$K$6),C21,INDIRECT('2. QT_LV'!$L$6),D21,INDIRECT('2. QT_LV'!$M$6),E21,INDIRECT('2. QT_LV'!$G$6),\"ON\",INDIRECT('2. QT_LV'!$C$6),\"Thai sản\")\n+COUNTIFS(INDIRECT('2. QT_LV'!$K$6),C21,INDIRECT('2. QT_LV'!$L$6),D21,INDIRECT('2. QT_LV'!$M$6),E21,INDIRECT('2. QT_LV'!$G$6),\"ON\",INDIRECT('2. QT_LV'!$C$6),\"Không lương\")","v":0},0,null,12,{"$f":"DATE(RIGHT('5.Dashboard'!$F$4,4),R21,1)","v":"2020-12-01"},{"$f":"COUNTIFS('2. QT_LV'!C:C,\"<>\"&\"Đã nghỉ việc\",'2. QT_LV'!O:O,\"<=\"&$S21,'2. QT_LV'!P:P,\">=\"&$S21,'2. QT_LV'!W:W,\"Không\")\n+COUNTIFS('2. QT_LV'!C:C,\"Đã nghỉ việc\",'2. QT_LV'!O:O,$S21)","v":0},{"$f":"COUNTIFS('2. QT_LV'!$O:$O,\">=\"&S21,'2. QT_LV'!$O:$O,\"<=\"&EOMONTH(S21,0),'2. QT_LV'!$T:$T,\"Tăng mới\")","v":0},{"$f":"COUNTIFS('3.TTNV'!AQ:AQ,\">=\"&S21,'3.TTNV'!AQ:AQ,\"<=\"&EOMONTH(S21,0))","v":0},0,{"$error":"#DIV/0!"},{"$error":"#DIV/0!"},null,"Tổng",null,{"$f":"AVERAGE(AC9:AC20)","v":0},0,0,null,"Tổng",{"$f":"SUM(AH9:AH20)","v":0},{"$f":"AVERAGE(AI9:AI20)","v":0},0,0,0,0,0,null,"Tổng",null,{"$f":"AVERAGE(AR9:AR20)","v":0},0,0,0]
[null,13,{"$f":"'1. QT_ĐV'!V22","v":"04. Phòng Marketing"},{"$f":"'1. QT_ĐV'!W22","v":"0"},{"$f":"'1. QT_ĐV'!X22","v":"Nhóm Plan"},{"$f":"COUNTIFS('2. QT_LV'!K:K,C22,'2. QT_LV'!L:L,D22,'2. QT_LV'!M:M,E22,'2. QT_LV'!D:D,\"ON\",'2. QT_LV'!C:C,\"<>\"&\"Đã nghỉ việc\",'2. QT_LV'!V:V,\"<>\"&$H$4&\"Thay đổi đơn vị\",'2. QT_LV'!V:V,\"<>\"&$H$4&\"Thay đổi chức danh\",'2. QT_LV'!W:W,\"<>\"&\"Có\")\n+COUNTIFS('2. QT_LV'!K:K,C22,'2. QT_LV'!L:L,D22,'2. QT_LV'!M:M,E22,'2. QT_LV'!G:G,\"ON\",'2. QT_LV'!T:T,\"Thay đổi chức danh\",'2. QT_LV'!O:O,\"=\"&$H$4)\n+COUNTIFS('2. QT_LV'!K:K,C22,'2. QT_LV'!L:L,D22,'2. QT_LV'!M:M,E22,'2. QT_LV'!G:G,\"ON\",'2. QT_LV'!T:T,\"Thay đổi đơn vị\",'2. QT_LV'!O:O,\"=\"&$H$4)\n+COUNTIFS('2. QT_LV'!K:K,C22,'2. QT_LV'!L:L,D22,'2. QT_LV'!M:M,E22,'2. QT_LV'!D:D,\"ON\",'2. QT_LV'!U:U,\"Nghỉ việc\",'2. QT_LV'!O:O,$H$4)","v":0},{"$f":"COUNTIFS('2. QT_LV'!K:K,C22,'2. QT_LV'!L:L,D22,'2. QT_LV'!M:M,E22,'2. QT_LV'!G:G,\"ON\",'2. QT_LV'!T:T,\"Tăng mới\",'2. QT_LV'!O:O,\">=\"&$H$4)","v":0},{"$f":"COUNTIFS('2. QT_LV'!K:K,C22,'2. QT_LV'!L:L,D22,'2. QT_LV'!M:M,E22,'2. QT_LV'!G:G,\"ON\",'2. QT_LV'!T:T,\"Thay đổi chức danh\",'2. QT_LV'!O:O,\">\"&$H$4)\n+COUNTIFS('2. QT_LV'!K:K,C22,'2. QT_LV'!L:L,D22,'2. QT_LV'!M:M,E22,'2. QT_LV'!G:G,\"ON\",'2. QT_LV'!T:T,\"Thay đổi đơn vị\",'2. QT_LV'!O:O,\">\"&$H$4)","v":0},{"$f":"(_xlfn.TEXTJOIN(\"\n\",TRUE,IF(\n(INDIRECT('2. QT_LV'!$K$6)=C22)*\n(INDIRECT('2. QT_LV'!$L$6)=D22)*\n(INDIRECT('2. QT_LV'!$M$6)=E22)*\n(INDIRECT('2. QT_LV'!$G$6)=\"ON\")*\n(INDIRECT('2. QT_LV'!$T$6)=\"Tăng mới\")*\n(INDIRECT('2. QT_LV'!$O$6)>=$H$4)=1,\nINDIRECT('2. QT_LV'!$I$6)&\" \"&INDIRECT('2. QT_LV'!$Q$6),\"\")))","v":""},{"$f":"COUNTIFS('2. QT_LV'!K:K,C22,'2. QT_LV'!L:L,D22,'2. QT_LV'!M:M,E22,'2. QT_LV'!G:G,\"ON\",'2. QT_LV'!U:U,\"Nghỉ việc\",'2. QT_LV'!O:O,\">=\"&$H$4)","v":0},{"$f":"COUNTIFS('2. QT_LV'!K:K,C22,'2. QT_LV'!L:L,D22,'2. QT_LV'!M:M,E22,'2. QT_LV'!G:G,\"ON\",'2. QT_LV'!X:X,\"Có\")","v":0},{"$f":"(_xlfn.TEXTJOIN(\"\n\",TRUE,IF(\n(INDIRECT('2. QT_LV'!$K$6)=C22)*\n(INDIRECT('2. QT_LV'!$L$6)=D22)*\n(INDIRECT('2. QT_LV'!$M$6)=E22)*\n(INDIRECT('2. QT_LV'!$G$6)=\"ON\")*\n(INDIRECT('2. QT_LV'!$U$6)=\"Nghỉ việc\")*\n(INDIRECT('2. QT_LV'!$O$6)>=$H$4)=1,\nINDIRECT('2. QT_LV'!$I$6)&\" \"&INDIRECT('2. QT_LV'!$Q$6),\"\")))","v":""},null,{"$f":"COUNTIFS('2. QT_LV'!K:K,C22,'2. QT_LV'!L:L,D22,'2. QT_LV'!M:M,E22,'2. QT_LV'!E:E,\"ON\",'2. QT_LV'!C:C,\"<>\"&\"Đã nghỉ việc\")","v":0},{"$f":"COUNTIFS(INDIRECT('2. QT_LV'!$K$6),C22,INDIRECT('2. QT_LV'!$L$6),D22,INDIRECT('2. QT_LV'!$M$6),E22,INDIRECT('2. QT_LV'!$G$6),\"ON\",INDIRECT('2. QT_LV'!$C$6),\"Thai sản\")\n+COUNTIFS(INDIRECT('2. QT_LV'!$K$6),C22,INDIRECT('2. QT_LV'!$L$6),D22,INDIRECT('2. QT_LV'!$M$6),E22,INDIRECT('2. QT_LV'!$G$6),\"ON\",INDIRECT('2. QT_LV'!$C$6),\"Không lương\")","v":0},0]
[null,14,{"$f":"'1. QT_ĐV'!V23","v":"04. Phòng Marketing"},{"$f":"'1. QT_ĐV'!W23","v":"0"},{"$f":"'1. QT_ĐV'!X23","v":"Nhóm Tiếp thị"},{"$f":"COUNTIFS('2. QT_LV'!K:K,C23,'2. QT_LV'!L:L,D23,'2. QT_LV'!M:M,E23,'2. QT_LV'!D:D,\"ON\",'2. QT_LV'!C:C,\"<>\"&\"Đã nghỉ việc\",'2. QT_LV'!V:V,\"<>\"&$H$4&\"Thay đổi đơn vị\",'2. QT_LV'!V:V,\"<>\"&$H$4&\"Thay đổi chức danh\",'2. QT_LV'!W:W,\"<>\"&\"Có\")\n+COUNTIFS('2. QT_LV'!K:K,C23,'2. QT_LV'!L:L,D23,'2. QT_LV'!M:M,E23,'2. QT_LV'!G:G,\"ON\",'2. QT_LV'!T:T,\"Thay đổi chức danh\",'2. QT_LV'!O:O,\"=\"&$H$4)\n+COUNTIFS('2. QT_LV'!K:K,C23,'2. QT_LV'!L:L,D23,'2. QT_LV'!M:M,E23,'2. QT_LV'!G:G,\"ON\",'2. QT_LV'!T:T,\"Thay đổi đơn vị\",'2. QT_LV'!O:O,\"=\"&$H$4)\n+COUNTIFS('2. QT_LV'!K:K,C23,'2. QT_LV'!L:L,D23,'2. QT_LV'!M:M,E23,'2. QT_LV'!D:D,\"ON\",'2. QT_LV'!U:U,\"Nghỉ việc\",'2. QT_LV'!O:O,$H$4)","v":0},{"$f":"COUNTIFS('2. QT_LV'!K:K,C23,'2. QT_LV'!L:L,D23,'2. QT_LV'!M:M,E23,'2. QT_LV'!G:G,\"ON\",'2. QT_LV'!T:T,\"Tăng mới\",'2. QT_LV'!O:O,\">=\"&$H$4)","v":0},{"$f":"COUNTIFS('2. QT_LV'!K:K,C23,'2. QT_LV'!L:L,D23,'2. QT_LV'!M:M,E23,'2. QT_LV'!G:G,\"ON\",'2. QT_LV'!T:T,\"Thay đổi chức danh\",'2. QT_LV'!O:O,\">\"&$H$4)\n+COUNTIFS('2. QT_LV'!K:K,C23,'2. QT_LV'!L:L,D23,'2. QT_LV'!M:M,E23,'2. QT_LV'!G:G,\"ON\",'2. QT_LV'!T:T,\"Thay đổi đơn vị\",'2. QT_LV'!O:O,\">\"&$H$4)","v":0},{"$f":"(_xlfn.TEXTJOIN(\"\n\",TRUE,IF(\n(INDIRECT('2. QT_LV'!$K$6)=C23)*\n(INDIRECT('2. QT_LV'!$L$6)=D23)*\n(INDIRECT('2. QT_LV'!$M$6)=E23)*\n(INDIRECT('2. QT_LV'!$G$6)=\"ON\")*\n(INDIRECT('2. QT_LV'!$T$6)=\"Tăng mới\")*\n(INDIRECT('2. QT_LV'!$O$6)>=$H$4)=1,\nINDIRECT('2. QT_LV'!$I$6)&\" \"&INDIRECT('2. QT_LV'!$Q$6),\"\")))","v":""},{"$f":"COUNTIFS('2. QT_LV'!K:K,C23,'2. QT_LV'!L:L,D23,'2. QT_LV'!M:M,E23,'2. QT_LV'!G:G,\"ON\",'2. QT_LV'!U:U,\"Nghỉ việc\",'2. QT_LV'!O:O,\">=\"&$H$4)","v":0},{"$f":"COUNTIFS('2. QT_LV'!K:K,C23,'2. QT_LV'!L:L,D23,'2. QT_LV'!M:M,E23,'2. QT_LV'!G:G,\"ON\",'2. QT_LV'!X:X,\"Có\")","v":0},{"$f":"(_xlfn.TEXTJOIN(\"\n\",TRUE,IF(\n(INDIRECT('2. QT_LV'!$K$6)=C23)*\n(INDIRECT('2. QT_LV'!$L$6)=D23)*\n(INDIRECT('2. QT_LV'!$M$6)=E23)*\n(INDIRECT('2. QT_LV'!$G$6)=\"ON\")*\n(INDIRECT('2. QT_LV'!$U$6)=\"Nghỉ việc\")*\n(INDIRECT('2. QT_LV'!$O$6)>=$H$4)=1,\nINDIRECT('2. QT_LV'!$I$6)&\" \"&INDIRECT('2. QT_LV'!$Q$6),\"\")))","v":""},null,{"$f":"COUNTIFS('2. QT_LV'!K:K,C23,'2. QT_LV'!L:L,D23,'2. QT_LV'!M:M,E23,'2. QT_LV'!E:E,\"ON\",'2. QT_LV'!C:C,\"<>\"&\"Đã nghỉ việc\")","v":0},{"$f":"COUNTIFS(INDIRECT('2. QT_LV'!$K$6),C23,INDIRECT('2. QT_LV'!$L$6),D23,INDIRECT('2. QT_LV'!$M$6),E23,INDIRECT('2. QT_LV'!$G$6),\"ON\",INDIRECT('2. QT_LV'!$C$6),\"Thai sản\")\n+COUNTIFS(INDIRECT('2. QT_LV'!$K$6),C23,INDIRECT('2. QT_LV'!$L$6),D23,INDIRECT('2. QT_LV'!$M$6),E23,INDIRECT('2. QT_LV'!$G$6),\"ON\",INDIRECT('2. QT_LV'!$C$6),\"Không lương\")","v":0},0]
[null,15,{"$f":"'1. QT_ĐV'!V24","v":"04. Phòng Marketing"},{"$f":"'1. QT_ĐV'!W24","v":"0"},{"$f":"'1. QT_ĐV'!X24","v":"Nhóm Thiết kế"},{"$f":"COUNTIFS('2. QT_LV'!K:K,C24,'2. QT_LV'!L:L,D24,'2. QT_LV'!M:M,E24,'2. QT_LV'!D:D,\"ON\",'2. QT_LV'!C:C,\"<>\"&\"Đã nghỉ việc\",'2. QT_LV'!V:V,\"<>\"&$H$4&\"Thay đổi đơn vị\",'2. QT_LV'!V:V,\"<>\"&$H$4&\"Thay đổi chức danh\",'2. QT_LV'!W:W,\"<>\"&\"Có\")\n+COUNTIFS('2. QT_LV'!K:K,C24,'2. QT_LV'!L:L,D24,'2. QT_LV'!M:M,E24,'2. QT_LV'!G:G,\"ON\",'2. QT_LV'!T:T,\"Thay đổi chức danh\",'2. QT_LV'!O:O,\"=\"&$H$4)\n+COUNTIFS('2. QT_LV'!K:K,C24,'2. QT_LV'!L:L,D24,'2. QT_LV'!M:M,E24,'2. QT_LV'!G:G,\"ON\",'2. QT_LV'!T:T,\"Thay đổi đơn vị\",'2. QT_LV'!O:O,\"=\"&$H$4)\n+COUNTIFS('2. QT_LV'!K:K,C24,'2. QT_LV'!L:L,D24,'2. QT_LV'!M:M,E24,'2. QT_LV'!D:D,\"ON\",'2. QT_LV'!U:U,\"Nghỉ việc\",'2. QT_LV'!O:O,$H$4)","v":0},{"$f":"COUNTIFS('2. QT_LV'!K:K,C24,'2. QT_LV'!L:L,D24,'2. QT_LV'!M:M,E24,'2. QT_LV'!G:G,\"ON\",'2. QT_LV'!T:T,\"Tăng mới\",'2. QT_LV'!O:O,\">=\"&$H$4)","v":0},{"$f":"COUNTIFS('2. QT_LV'!K:K,C24,'2. QT_LV'!L:L,D24,'2. QT_LV'!M:M,E24,'2. QT_LV'!G:G,\"ON\",'2. QT_LV'!T:T,\"Thay đổi chức danh\",'2. QT_LV'!O:O,\">\"&$H$4)\n+COUNTIFS('2. QT_LV'!K:K,C24,'2. QT_LV'!L:L,D24,'2. QT_LV'!M:M,E24,'2. QT_LV'!G:G,\"ON\",'2. QT_LV'!T:T,\"Thay đổi đơn vị\",'2. QT_LV'!O:O,\">\"&$H$4)","v":0},{"$f":"(_xlfn.TEXTJOIN(\"\n\",TRUE,IF(\n(INDIRECT('2. QT_LV'!$K$6)=C24)*\n(INDIRECT('2. QT_LV'!$L$6)=D24)*\n(INDIRECT('2. QT_LV'!$M$6)=E24)*\n(INDIRECT('2. QT_LV'!$G$6)=\"ON\")*\n(INDIRECT('2. QT_LV'!$T$6)=\"Tăng mới\")*\n(INDIRECT('2. QT_LV'!$O$6)>=$H$4)=1,\nINDIRECT('2. QT_LV'!$I$6)&\" \"&INDIRECT('2. QT_LV'!$Q$6),\"\")))","v":""},{"$f":"COUNTIFS('2. QT_LV'!K:K,C24,'2. QT_LV'!L:L,D24,'2. QT_LV'!M:M,E24,'2. QT_LV'!G:G,\"ON\",'2. QT_LV'!U:U,\"Nghỉ việc\",'2. QT_LV'!O:O,\">=\"&$H$4)","v":0},{"$f":"COUNTIFS('2. QT_LV'!K:K,C24,'2. QT_LV'!L:L,D24,'2. QT_LV'!M:M,E24,'2. QT_LV'!G:G,\"ON\",'2. QT_LV'!X:X,\"Có\")","v":0},{"$f":"(_xlfn.TEXTJOIN(\"\n\",TRUE,IF(\n(INDIRECT('2. QT_LV'!$K$6)=C24)*\n(INDIRECT('2. QT_LV'!$L$6)=D24)*\n(INDIRECT('2. QT_LV'!$M$6)=E24)*\n(INDIRECT('2. QT_LV'!$G$6)=\"ON\")*\n(INDIRECT('2. QT_LV'!$U$6)=\"Nghỉ việc\")*\n(INDIRECT('2. QT_LV'!$O$6)>=$H$4)=1,\nINDIRECT('2. QT_LV'!$I$6)&\" \"&INDIRECT('2. QT_LV'!$Q$6),\"\")))","v":""},null,{"$f":"COUNTIFS('2. QT_LV'!K:K,C24,'2. QT_LV'!L:L,D24,'2. QT_LV'!M:M,E24,'2. QT_LV'!E:E,\"ON\",'2. QT_LV'!C:C,\"<>\"&\"Đã nghỉ việc\")","v":0},{"$f":"COUNTIFS(INDIRECT('2. QT_LV'!$K$6),C24,INDIRECT('2. QT_LV'!$L$6),D24,INDIRECT('2. QT_LV'!$M$6),E24,INDIRECT('2. QT_LV'!$G$6),\"ON\",INDIRECT('2. QT_LV'!$C$6),\"Thai sản\")\n+COUNTIFS(INDIRECT('2. QT_LV'!$K$6),C24,INDIRECT('2. QT_LV'!$L$6),D24,INDIRECT('2. QT_LV'!$M$6),E24,INDIRECT('2. QT_LV'!$G$6),\"ON\",INDIRECT('2. QT_LV'!$C$6),\"Không lương\")","v":0},0]

{"sheet":"3.TTNV","index":5,"n_rows":18,"n_cols":59,"rows_kept":18,"cut":false,"hidden":false,"merged":[]}
["DANH SÁCH NHÂN VIÊN"]
["Mã NV hiện tại",null,{"$f":"MAX(INDIRECT($C$6))","v":170415}]
["Tình trạng nhân sự theo thời điểm",null,null,"Kỳ được chọn theo BC Nhân sự",{"$f":"VLOOKUP(D3,Define!G18:H21,2,0)","v":4}]
[]
["CT","CT","CT","CT","CT","CT","CT","CT","CT","CT","CT","CT","CT","CT","CT","CT","CT","CT","CT","CT","CT","CT","CT","CT","CT","CT","CT","CT","CT","CT","CT","CT","CT","CT","CT","CT","Điền","Điền","CT","CT","CT","CT","CT","CT","Chọn","Điền","CT","Điền","CT","CT","Điền","Điền","Điền","Điền","Điền","Điền","Điền","Điền","Điền"]
[null,null,{"$f":"ADDRESS(ROW($C$8),3,1,1) & \":\" & ADDRESS(MAX(A8:A999857)+7,3,1,1)","v":"$C$8:$C$18"},{"$f":"SUBTOTAL(3,D8:D32)","v":11},null,null,null,null,null,null,null,null,null,null,null,null,null,null,null,null,null,null,null,null,null,null,null,null,null,null,null,null,null,null,null,null,null,null,null,null,null,null,null,null,null,null,null,{"$f":"SUBTOTAL(9,AV8:AV14)","v":77000000},{"$f":"SUBTOTAL(9,AW8:AW14)","v":13200000},{"$f":"SUBTOTAL(9,AX8:AX14)","v":90200000}]
["STT","Tình trạng","MSNV","Họ và tên","Giới tính","Phòng","Bộ phận","Nhóm","Chức danh","Ngày sinh","Tháng sinh","Nơi sinh","Địa chỉ thường trú","Địa chỉ hiện tại","Số điện thoại","E-mail","Tình trạng hôn nhân","Vợ/chồng","Năm sinh vợ/chồng","Con thứ 1","Năm sinh con thứ 1","Con thứ 2","Năm sinh con thứ 2","Con thứ 3","Năm sinh con thứ 3","Số CMND","Ngày cấp","Nơi cấp","Mã số thuế TNCN","Số người phụ thuộc","Trình độ","Chuyên ngành","Trường","Ngày vào công ty","Ngày vào công ty (Text)","Thâm niên tới hết kỳ","Ngày ký HĐ chính thức","Loại HĐLĐ hiện tại","Loại thanh toán lương","Họ tên chuyển khoản","Số tài khoản","Ngân hàng","Ngày nghỉ việc","Ngày nghỉ việc (Text)","Xin nghỉ/Công ty cho nghỉ","Lý do nghỉ việc","Mã ID Chấm công","Giảm trừ bản thân","Giảm trừ người phụ thuộc","Tổng giảm trừ gia cảnh","SƠ YẾU LÝ LỊCH CÓ XÁC NHẬN CỦA ĐỊA PHƯƠNG","CMND (bản sao công chứng)","GIẤY KHÁM SỨC KHỎE","GIẤY KHAI SINH (bản sao công chứng)","HỘ KHẨU (bản sao công chứng)","BẰNG TỐT NGHIỆP (bản sao công chứng)","ẢNH\n (3x4)","Tình trạng hồ sơ","Hồ sơ BHXH"]
[{"$f":"ROW()-ROW($A$7)","v":1},{"$f":"IFERROR(CHOOSE($E$3,\nINDEX(INDIRECT('2. QT_LV'!$C$6),MATCH(1,(INDIRECT('2. QT_LV'!$D$6)=\"ON\")*(INDIRECT('2. QT_LV'!$H$6)=C8),0),1),\nINDEX(INDIRECT('2. QT_LV'!$C$6),MATCH(1,(INDIRECT('2. QT_LV'!$E$6)=\"ON\")*(INDIRECT('2. QT_LV'!$H$6)=C8),0),1),\nINDEX(INDIRECT('2. QT_LV'!$C$6),MATCH(1,(INDIRECT('2. QT_LV'!$F$6)=\"ON\")*(INDIRECT('2. QT_LV'!$H$6)=C8),0),1),\nINDEX(INDIRECT('2. QT_LV'!$C$6),MATCH(1,(INDIRECT('2. QT_LV'!$G$6)=\"ON\")*(INDIRECT('2. QT_LV'!$H$6)=C8),0),1)),\"Chưa vào\")","v":"Chưa vào"},{"$f":"DSNV_Import!A4","v":170415},{"$f":"IFERROR(INDEX(DSNV_Import!$B:$B,MATCH('3.TTNV'!$C8,DSNV_Import!$A:$A,0),1),\"\")","v":"Đàm Anh Tú"},{"$f":"IFERROR(INDEX(DSNV_Import!$C:$C,MATCH('3.TTNV'!$C8,DSNV_Import!$A:$A,0),1),\"\")","v":"Nam"},{"$f":"IFERROR(CHOOSE($E$3,\nINDEX(INDIRECT('2. QT_LV'!$K$6),MATCH(1,(INDIRECT('2. QT_LV'!$D$6)=\"ON\")*(INDIRECT('2. QT_LV'!$H$6)=C8),0),1),\nINDEX(INDIRECT('2. QT_LV'!$K$6),MATCH(1,(INDIRECT('2. QT_LV'!$E$6)=\"ON\")*(INDIRECT('2. QT_LV'!$H$6)=C8),0),1),\nINDEX(INDIRECT('2. QT_LV'!$K$6),MATCH(1,(INDIRECT('2. QT_LV'!$F$6)=\"ON\")*(INDIRECT('2. QT_LV'!$H$6)=C8),0),1),\nINDEX(INDIRECT('2. QT_LV'!$K$6),MATCH(1,(INDIRECT('2. QT_LV'!$G$6)=\"ON\")*(INDIRECT('2. QT_LV'!$H$6)=C8),0),1)),\"Chưa vào\")","v":"Chưa vào"},{"$f":"IFERROR(CHOOSE($E$3,\nINDEX(INDIRECT('2. QT_LV'!$L$6),MATCH(1,(INDIRECT('2. QT_LV'!$D$6)=\"ON\")*(INDIRECT('2. QT_LV'!$H$6)=C8),0),1),\nINDEX(INDIRECT('2. QT_LV'!$L$6),MATCH(1,(INDIRECT('2. QT_LV'!$E$6)=\"ON\")*(INDIRECT('2. QT_LV'!$H$6)=C8),0),1),\nINDEX(INDIRECT('2. QT_LV'!$L$6),MATCH(1,(INDIRECT('2. QT_LV'!$F$6)=\"ON\")*(INDIRECT('2. QT_LV'!$H$6)=C8),0),1),\nINDEX(INDIRECT('2. QT_LV'!$L$6),MATCH(1,(INDIRECT('2. QT_LV'!$G$6)=\"ON\")*(INDIRECT('2. QT_LV'!$H$6)=C8),0),1)),\"Chưa vào\")","v":"Chưa vào"},{"$f":"IFERROR(CHOOSE($E$3,\nINDEX(INDIRECT('2. QT_LV'!$M$6),MATCH(1,(INDIRECT('2. QT_LV'!$D$6)=\"ON\")*(INDIRECT('2. QT_LV'!$H$6)=C8),0),1),\nINDEX(INDIRECT('2. QT_LV'!$M$6),MATCH(1,(INDIRECT('2. QT_LV'!$E$6)=\"ON\")*(INDIRECT('2. QT_LV'!$H$6)=C8),0),1),\nINDEX(INDIRECT('2. QT_LV'!$M$6),MATCH(1,(INDIRECT('2. QT_LV'!$F$6)=\"ON\")*(INDIRECT('2. QT_LV'!$H$6)=C8),0),1),\nINDEX(INDIRECT('2. QT_LV'!$M$6),MATCH(1,(INDIRECT('2. QT_LV'!$G$6)=\"ON\")*(INDIRECT('2. QT_LV'!$H$6)=C8),0),1)),\"Chưa vào\")","v":"Chưa vào"},{"$f":"IFERROR(CHOOSE($E$3,\nINDEX(INDIRECT('2. QT_LV'!$N$6),MATCH(1,(INDIRECT('2. QT_LV'!$D$6)=\"ON\")*(INDIRECT('2. QT_LV'!$H$6)=C8),0),1),\nINDEX(INDIRECT('2. QT_LV'!$N$6),MATCH(1,(INDIRECT('2. QT_LV'!$E$6)=\"ON\")*(INDIRECT('2. QT_LV'!$H$6)=C8),0),1),\nINDEX(INDIRECT('2. QT_LV'!$N$6),MATCH(1,(INDIRECT('2. QT_LV'!$F$6)=\"ON\")*(INDIRECT('2. QT_LV'!$H$6)=C8),0),1),\nINDEX(INDIRECT('2. QT_LV'!$N$6),MATCH(1,(INDIRECT('2. QT_LV'!$G$6)=\"ON\")*(INDIRECT('2. QT_LV'!$H$6)=C8),0),1)),\"Chưa vào\")","v":"Chưa vào"},{"$f":"IFERROR(INDEX(DSNV_Import!$D:$D,MATCH('3.TTNV'!$C8,DSNV_Import!$A:$A,0),1),\"\")","v":"1991-06-07"},{"$f":"IFERROR(MONTH(J8),\"\")","v":6},{"$f":"IFERROR(INDEX(DSNV_Import!$E:$E,MATCH('3.TTNV'!$C8,DSNV_Import!$A:$A,0),1),\"\")","v":"Hà Nội"},{"$f":"IFERROR(INDEX(DSNV_Import!$F:$F,MATCH('3.TTNV'!$C8,DSNV_Import!$A:$A,0),1),\"\")","v":"Số 123, Ðường ABC, Phường Tân Mai, Quận Hoàng Mai, Tp Hà Nội"},{"$f":"IFERROR(INDEX(DSNV_Import!$G:$G,MATCH('3.TTNV'!$C8,DSNV_Import!$A:$A,0),1),\"\")","v":"Số 123, Ðường ABC, Phường Tân Mai, Quận Hoàng Mai, Tp Hà Nội"},{"$f":"IFERROR(INDEX(DSNV_Import!$H:$H,MATCH('3.TTNV'!$C8,DSNV_Import!$A:$A,0),1),\"\")","v":"0934.123.321"},{"$f":"IFERROR(INDEX(DSNV_Import!$I:$I,MATCH('3.TTNV'!$C8,DSNV_Import!$A:$A,0),1),\"\")","v":"nguyenvana@gmail.com"},{"$f":"IFERROR(INDEX(DSNV_Import!$J:$J,MATCH('3.TTNV'!$C8,DSNV_Import!$A:$A,0),1),\"\")","v":"Độc thân"},{"$f":"IFERROR(\nIF(INDEX(DSNV_Import!$K:$K,MATCH('3.TTNV'!$C8,DSNV_Import!$A:$A,0),1)=0,\"Chưa có TT\",INDEX(DSNV_Import!$K:$K,MATCH('3.TTNV'!$C8,DSNV_Import!$A:$A,0),1)),\"\")","v":"Chưa có TT"},{"$f":"IFERROR(\nIF(INDEX(DSNV_Import!$L:$L,MATCH('3.TTNV'!$C8,DSNV_Import!$A:$A,0),1)=0,\"Chưa có TT\",INDEX(DSNV_Import!$L:$L,MATCH('3.TTNV'!$C8,DSNV_Import!$A:$A,0),1)),\"\")","v":"Chưa có TT"},{"$f":"IFERROR(\nIF(INDEX(DSNV_Import!$M:$M,MATCH('3.TTNV'!$C8,DSNV_Import!$A:$A,0),1)=0,\"Chưa có TT\",INDEX(DSNV_Import!$M:$M,MATCH('3.TTNV'!$C8,DSNV_Import!$A:$A,0),1)),\"\")","v":"Chưa có TT"},{"$f":"IFERROR(\nIF(INDEX(DSNV_Import!$N:$N,MATCH('3.TTNV'!$C8,DSNV_Import!$A:$A,0),1)=0,\"Chưa có TT\",INDEX(DSNV_Import!$N:$N,MATCH('3.TTNV'!$C8,DSNV_Import!$A:$A,0),1)),\"\")","v":"Chưa có TT"},{"$f":"IFERROR(\nIF(INDEX(DSNV_Import!$O:$O,MATCH('3.TTNV'!$C8,DSNV_Import!$A:$A,0),1)=0,\"Chưa có TT\",INDEX(DSNV_Import!$O:$O,MATCH('3.TTNV'!$C8,DSNV_Import!$A:$A,0),1)),\"\")","v":"Chưa có TT"},{"$f":"IFERROR(\nIF(INDEX(DSNV_Import!$P:$P,MATCH('3.TTNV'!$C8,DSNV_Import!$A:$A,0),1)=0,\"Chưa có TT\",INDEX(DSNV_Import!$P:$P,MATCH('3.TTNV'!$C8,DSNV_Import!$A:$A,0),1)),\"\")","v":"Chưa có TT"},{"$f":"IFERROR(\nIF(INDEX(DSNV_Import!$Q:$Q,MATCH('3.TTNV'!$C8,DSNV_Import!$A:$A,0),1)=0,\"Chưa có TT\",INDEX(DSNV_Import!$Q:$Q,MATCH('3.TTNV'!$C8,DSNV_Import!$A:$A,0),1)),\"\")","v":"Chưa có TT"},{"$f":"IFERROR(\nIF(INDEX(DSNV_Import!$R:$R,MATCH('3.TTNV'!$C8,DSNV_Import!$A:$A,0),1)=0,\"Chưa có TT\",INDEX(DSNV_Import!$R:$R,MATCH('3.TTNV'!$C8,DSNV_Import!$A:$A,0),1)),\"\")","v":"Chưa có TT"},{"$f":"IFERROR(\nIF(INDEX(DSNV_Import!$S:$S,MATCH('3.TTNV'!$C8,DSNV_Import!$A:$A,0),1)=0,\"Chưa có TT\",INDEX(DSNV_Import!$S:$S,MATCH('3.TTNV'!$C8,DSNV_Import!$A:$A,0),1)),\"\")","v":123456789},{"$f":"IFERROR(\nIF(INDEX(DSNV_Import!$T:$T,MATCH('3.TTNV'!$C8,DSNV_Import!$A:$A,0),1)=0,\"Chưa có TT\",INDEX(DSNV_Import!$T:$T,MATCH('3.TTNV'!$C8,DSNV_Import!$A:$A,0),1)),\"\")","v":"2010-12-21"},{"$f":"IFERROR(\nIF(INDEX(DSNV_Import!$U:$U,MATCH('3.TTNV'!$C8,DSNV_Import!$A:$A,0),1)=0,\"Chưa có TT\",INDEX(DSNV_Import!$U:$U,MATCH('3.TTNV'!$C8,DSNV_Import!$A:$A,0),1)),\"\")","v":"Hà Nội"},{"$f":"IFERROR(\nIF(INDEX(DSNV_Import!$V:$V,MATCH('3.TTNV'!$C8,DSNV_Import!$A:$A,0),1)=0,\"Chưa có TT\",INDEX(DSNV_Import!$V:$V,MATCH('3.TTNV'!$C8,DSNV_Import!$A:$A,0),1)),\"\")","v":"123345456767"},{"$f":"IFERROR(\nIF(INDEX(DSNV_Import!$W:$W,MATCH('3.TTNV'!$C8,DSNV_Import!$A:$A,0),1)=0,\"Chưa có TT\",INDEX(DSNV_Import!$W:$W,MATCH('3.TTNV'!$C8,DSNV_Import!$A:$A,0),1)),\"\")","v":3},{"$f":"IFERROR(\nIF(INDEX(DSNV_Import!$X:$X,MATCH('3.TTNV'!$C8,DSNV_Import!$A:$A,0),1)=0,\"Chưa có TT\",INDEX(DSNV_Import!$X:$X,MATCH('3.TTNV'!$C8,DSNV_Import!$A:$A,0),1)),\"\")","v":"Đại học"},{"$f":"IFERROR(\nIF(INDEX(DSNV_Import!$Y:$Y,MATCH('3.TTNV'!$C8,DSNV_Import!$A:$A,0),1)=0,\"Chưa có TT\",INDEX(DSNV_Import!$Y:$Y,MATCH('3.TTNV'!$C8,DSNV_Import!$A:$A,0),1)),\"\")","v":"Kinh tế lao động"},{"$f":"IFERROR(\nIF(INDEX(DSNV_Import!$Z:$Z,MATCH('3.TTNV'!$C8,DSNV_Import!$A:$A,0),1)=0,\"Chưa có TT\",INDEX(DSNV_Import!$Z:$Z,MATCH('3.TTNV'!$C8,DSNV_Import!$A:$A,0),1)),\"\")","v":"NEU"},{"$f":"INDEX(INDIRECT('2. QT_LV'!$O$6),MATCH(1,\n(INDIRECT('2. QT_LV'!$H$6)=C8)*\n(INDIRECT('2. QT_LV'!$T$6)=\"Tăng mới\")*\n(INDIRECT('2. QT_LV'!$B$6)=_xlfn.MAXIFS(INDIRECT('2. QT_LV'!$B$6),INDIRECT('2. QT_LV'!$H$6),C8,INDIRECT('2. QT_LV'!$T$6),\"Tăng mới\")),\n0),1)","v":{"$error":"#N/A"}},{"$f":"TEXT(DAY(AH8),\"00\")&\"/\"&TEXT(MONTH(AH8),\"00\")&\"/\"&YEAR(AH8)","v":{"$error":"#N/A"}},{"$f":"('4.Report'!$L$4-AH8)/365","v":{"$error":"#N/A"}},null,null,{"$f":"IFERROR(\nIF(INDEX(DSNV_Import!$AA:$AA,MATCH('3.TTNV'!$C8,DSNV_Import!$A:$A,0),1)=0,\"Chưa có TT\",INDEX(DSNV_Import!$AA:$AA,MATCH('3.TTNV'!$C8,DSNV_Import!$A:$A,0),1)),\"\")","v":"Tiền Mặt"},{"$f":"IFERROR(\nIF(INDEX(DSNV_Import!$AB:$AB,MATCH('3.TTNV'!$C8,DSNV_Import!$A:$A,0),1)=0,\"Chưa có TT\",INDEX(DSNV_Import!$AB:$AB,MATCH('3.TTNV'!$C8,DSNV_Import!$A:$A,0),1)),\"\")","v":"Chưa có TT"},{"$f":"IFERROR(\nIF(INDEX(DSNV_Import!$AC:$AC,MATCH('3.TTNV'!$C8,DSNV_Import!$A:$A,0),1)=0,\"Chưa có TT\",INDEX(DSNV_Import!$AC:$AC,MATCH('3.TTNV'!$C8,DSNV_Import!$A:$A,0),1)),\"\")","v":"Chưa có TT"},{"$f":"IFERROR(\nIF(INDEX(DSNV_Import!$AD:$AD,MATCH('3.TTNV'!$C8,DSNV_Import!$A:$A,0),1)=0,\"Chưa có TT\",INDEX(DSNV_Import!$AD:$AD,MATCH('3.TTNV'!$C8,DSNV_Import!$A:$A,0),1)),\"\")","v":"Chưa có TT"},{"$f":"IFERROR(INDEX(INDIRECT('2. QT_LV'!$O$6),MATCH(1,\n(INDIRECT('2. QT_LV'!$H$6)=C8)*\n(INDIRECT('2. QT_LV'!$U$6)=\"Nghỉ việc\")*\n(INDIRECT('2. QT_LV'!$B$6)=_xlfn.MAXIFS(INDIRECT('2. QT_LV'!$B$6),INDIRECT('2. QT_LV'!$H$6),C8,INDIRECT('2. QT_LV'!$U$6),\"Nghỉ việc\"))*\n(INDIRECT('2. QT_LV'!$O$6)>=AH8),0),1),\nDATE(2100,12,31))","v":"2100-12-31"},{"$f":"TEXT(DAY(AQ8),\"00\")&\"/\"&TEXT(MONTH(AQ8),\"00\")&\"/\"&YEAR(AQ8)","v":"31/12/2100"},null,null,{"$f":"RIGHT(C8,3)","v":"415"},11000000,{"$f":"AD8*4400000","v":13200000},{"$f":"AV8+AW8","v":24200000}]
[2,{"$f":"IFERROR(CHOOSE($E$3,\nINDEX(INDIRECT('2. QT_LV'!$C$6),MATCH(1,(INDIRECT('2. QT_LV'!$D$6)=\"ON\")*(INDIRECT('2. QT_LV'!$H$6)=C9),0),1),\nINDEX(INDIRECT('2. QT_LV'!$C$6),MATCH(1,(INDIRECT('2. QT_LV'!$E$6)=\"ON\")*(INDIRECT('2. QT_LV'!$H$6)=C9),0),1),\nINDEX(INDIRECT('2. QT_LV'!$C$6),MATCH(1,(INDIRECT('2. QT_LV'!$F$6)=\"ON\")*(INDIRECT('2. QT_LV'!$H$6)=C9),0),1),\nINDEX(INDIRECT('2. QT_LV'!$C$6),MATCH(1,(INDIRECT('2. QT_LV'!$G$6)=\"ON\")*(INDIRECT('2. QT_LV'!$H$6)=C9),0),1)),\"Chưa vào\")","v":"Chưa vào"},{"$f":"DSNV_Import!A5","v":0},{"$f":"IFERROR(INDEX(DSNV_Import!$B:$B,MATCH('3.TTNV'!$C9,DSNV_Import!$A:$A,0),1),\"\")","v":""},{"$f":"IFERROR(INDEX(DSNV_Import!$C:$C,MATCH('3.TTNV'!$C9,DSNV_Import!$A:$A,0),1),\"\")","v":""},{"$f":"IFERROR(CHOOSE($E$3,\nINDEX(INDIRECT('2. QT_LV'!$K$6),MATCH(1,(INDIRECT('2. QT_LV'!$D$6)=\"ON\")*(INDIRECT('2. QT_LV'!$H$6)=C9),0),1),\nINDEX(INDIRECT('2. QT_LV'!$K$6),MATCH(1,(INDIRECT('2. QT_LV'!$E$6)=\"ON\")*(INDIRECT('2. QT_LV'!$H$6)=C9),0),1),\nINDEX(INDIRECT('2. QT_LV'!$K$6),MATCH(1,(INDIRECT('2. QT_LV'!$F$6)=\"ON\")*(INDIRECT('2. QT_LV'!$H$6)=C9),0),1),\nINDEX(INDIRECT('2. QT_LV'!$K$6),MATCH(1,(INDIRECT('2. QT_LV'!$G$6)=\"ON\")*(INDIRECT('2. QT_LV'!$H$6)=C9),0),1)),\"Chưa vào\")","v":"Chưa vào"},{"$f":"IFERROR(CHOOSE($E$3,\nINDEX(INDIRECT('2. QT_LV'!$L$6),MATCH(1,(INDIRECT('2. QT_LV'!$D$6)=\"ON\")*(INDIRECT('2. QT_LV'!$H$6)=C9),0),1),\nINDEX(INDIRECT('2. QT_LV'!$L$6),MATCH(1,(INDIRECT('2. QT_LV'!$E$6)=\"ON\")*(INDIRECT('2. QT_LV'!$H$6)=C9),0),1),\nINDEX(INDIRECT('2. QT_LV'!$L$6),MATCH(1,(INDIRECT('2. QT_LV'!$F$6)=\"ON\")*(INDIRECT('2. QT_LV'!$H$6)=C9),0),1),\nINDEX(INDIRECT('2. QT_LV'!$L$6),MATCH(1,(INDIRECT('2. QT_LV'!$G$6)=\"ON\")*(INDIRECT('2. QT_LV'!$H$6)=C9),0),1)),\"Chưa vào\")","v":"Chưa vào"},{"$f":"IFERROR(CHOOSE($E$3,\nINDEX(INDIRECT('2. QT_LV'!$M$6),MATCH(1,(INDIRECT('2. QT_LV'!$D$6)=\"ON\")*(INDIRECT('2. QT_LV'!$H$6)=C9),0),1),\nINDEX(INDIRECT('2. QT_LV'!$M$6),MATCH(1,(INDIRECT('2. QT_LV'!$E$6)=\"ON\")*(INDIRECT('2. QT_LV'!$H$6)=C9),0),1),\nINDEX(INDIRECT('2. QT_LV'!$M$6),MATCH(1,(INDIRECT('2. QT_LV'!$F$6)=\"ON\")*(INDIRECT('2. QT_LV'!$H$6)=C9),0),1),\nINDEX(INDIRECT('2. QT_LV'!$M$6),MATCH(1,(INDIRECT('2. QT_LV'!$G$6)=\"ON\")*(INDIRECT('2. QT_LV'!$H$6)=C9),0),1)),\"Chưa vào\")","v":"Chưa vào"},{"$f":"IFERROR(CHOOSE($E$3,\nINDEX(INDIRECT('2. QT_LV'!$N$6),MATCH(1,(INDIRECT('2. QT_LV'!$D$6)=\"ON\")*(INDIRECT('2. QT_LV'!$H$6)=C9),0),1),\nINDEX(INDIRECT('2. QT_LV'!$N$6),MATCH(1,(INDIRECT('2. QT_LV'!$E$6)=\"ON\")*(INDIRECT('2. QT_LV'!$H$6)=C9),0),1),\nINDEX(INDIRECT('2. QT_LV'!$N$6),MATCH(1,(INDIRECT('2. QT_LV'!$F$6)=\"ON\")*(INDIRECT('2. QT_LV'!$H$6)=C9),0),1),\nINDEX(INDIRECT('2. QT_LV'!$N$6),MATCH(1,(INDIRECT('2. QT_LV'!$G$6)=\"ON\")*(INDIRECT('2. QT_LV'!$H$6)=C9),0),1)),\"Chưa vào\")","v":"Chưa vào"},{"$f":"IFERROR(INDEX(DSNV_Import!$D:$D,MATCH('3.TTNV'!$C9,DSNV_Import!$A:$A,0),1),\"\")","v":""},{"$f":"IFERROR(MONTH(J9),\"\")","v":""},{"$f":"IFERROR(INDEX(DSNV_Import!$E:$E,MATCH('3.TTNV'!$C9,DSNV_Import!$A:$A,0),1),\"\")","v":""},{"$f":"IFERROR(INDEX(DSNV_Import!$F:$F,MATCH('3.TTNV'!$C9,DSNV_Import!$A:$A,0),1),\"\")","v":""},{"$f":"IFERROR(INDEX(DSNV_Import!$G:$G,MATCH('3.TTNV'!$C9,DSNV_Import!$A:$A,0),1),\"\")","v":""},{"$f":"IFERROR(INDEX(DSNV_Import!$H:$H,MATCH('3.TTNV'!$C9,DSNV_Import!$A:$A,0),1),\"\")","v":""},{"$f":"IFERROR(INDEX(DSNV_Import!$I:$I,MATCH('3.TTNV'!$C9,DSNV_Import!$A:$A,0),1),\"\")","v":""},{"$f":"IFERROR(INDEX(DSNV_Import!$J:$J,MATCH('3.TTNV'!$C9,DSNV_Import!$A:$A,0),1),\"\")","v":""},{"$f":"IFERROR(\nIF(INDEX(DSNV_Import!$K:$K,MATCH('3.TTNV'!$C9,DSNV_Import!$A:$A,0),1)=0,\"Chưa có TT\",INDEX(DSNV_Import!$K:$K,MATCH('3.TTNV'!$C9,DSNV_Import!$A:$A,0),1)),\"\")","v":""},{"$f":"IFERROR(\nIF(INDEX(DSNV_Import!$L:$L,MATCH('3.TTNV'!$C9,DSNV_Import!$A:$A,0),1)=0,\"Chưa có TT\",INDEX(DSNV_Import!$K:$K,MATCH('3.TTNV'!$C9,DSNV_Import!$A:$A,0),1)),\"\")","v":""},null,null,null,null,null,null,null,null,null,null,null,null,null,null,{"$f":"INDEX(INDIRECT('2. QT_LV'!$O$6),MATCH(1,\n(INDIRECT('2. QT_LV'!$H$6)=C9)*\n(INDIRECT('2. QT_LV'!$T$6)=\"Tăng mới\")*\n(INDIRECT('2. QT_LV'!$B$6)=_xlfn.MAXIFS(INDIRECT('2. QT_LV'!$B$6),INDIRECT('2. QT_LV'!$H$6),C9,INDIRECT('2. QT_LV'!$T$6),\"Tăng mới\")),\n0),1)","v":{"$error":"#N/A"}},{"$f":"TEXT(DAY(AH9),\"00\")&\"/\"&TEXT(MONTH(AH9),\"00\")&\"/\"&YEAR(AH9)","v":{"$error":"#N/A"}},{"$f":"('4.Report'!$L$4-AH9)/365","v":{"$error":"#N/A"}},null,null,null,null,null,null,{"$f":"IFERROR(INDEX(INDIRECT('2. QT_LV'!$O$6),MATCH(1,\n(INDIRECT('2. QT_LV'!$H$6)=C9)*\n(INDIRECT('2. QT_LV'!$U$6)=\"Nghỉ việc\")*\n(INDIRECT('2. QT_LV'!$B$6)=_xlfn.MAXIFS(INDIRECT('2. QT_LV'!$B$6),INDIRECT('2. QT_LV'!$H$6),C9,INDIRECT('2. QT_LV'!$U$6),\"Nghỉ việc\"))*\n(INDIRECT('2. QT_LV'!$O$6)>=AH9),0),1),\nDATE(2100,12,31))","v":"2100-12-31"},"31/12/2100",null,null,"0",11000000,{"$f":"AD9*4400000","v":0},11000000]
[3,{"$f":"IFERROR(CHOOSE($E$3,\nINDEX(INDIRECT('2. QT_LV'!$C$6),MATCH(1,(INDIRECT('2. QT_LV'!$D$6)=\"ON\")*(INDIRECT('2. QT_LV'!$H$6)=C10),0),1),\nINDEX(INDIRECT('2. QT_LV'!$C$6),MATCH(1,(INDIRECT('2. QT_LV'!$E$6)=\"ON\")*(INDIRECT('2. QT_LV'!$H$6)=C10),0),1),\nINDEX(INDIRECT('2. QT_LV'!$C$6),MATCH(1,(INDIRECT('2. QT_LV'!$F$6)=\"ON\")*(INDIRECT('2. QT_LV'!$H$6)=C10),0),1),\nINDEX(INDIRECT('2. QT_LV'!$C$6),MATCH(1,(INDIRECT('2. QT_LV'!$G$6)=\"ON\")*(INDIRECT('2. QT_LV'!$H$6)=C10),0),1)),\"Chưa vào\")","v":"Chưa vào"},{"$f":"DSNV_Import!A6","v":0},{"$f":"IFERROR(INDEX(DSNV_Import!$B:$B,MATCH('3.TTNV'!$C10,DSNV_Import!$A:$A,0),1),\"\")","v":""},{"$f":"IFERROR(INDEX(DSNV_Import!$C:$C,MATCH('3.TTNV'!$C10,DSNV_Import!$A:$A,0),1),\"\")","v":""},{"$f":"IFERROR(CHOOSE($E$3,\nINDEX(INDIRECT('2. QT_LV'!$K$6),MATCH(1,(INDIRECT('2. QT_LV'!$D$6)=\"ON\")*(INDIRECT('2. QT_LV'!$H$6)=C10),0),1),\nINDEX(INDIRECT('2. QT_LV'!$K$6),MATCH(1,(INDIRECT('2. QT_LV'!$E$6)=\"ON\")*(INDIRECT('2. QT_LV'!$H$6)=C10),0),1),\nINDEX(INDIRECT('2. QT_LV'!$K$6),MATCH(1,(INDIRECT('2. QT_LV'!$F$6)=\"ON\")*(INDIRECT('2. QT_LV'!$H$6)=C10),0),1),\nINDEX(INDIRECT('2. QT_LV'!$K$6),MATCH(1,(INDIRECT('2. QT_LV'!$G$6)=\"ON\")*(INDIRECT('2. QT_LV'!$H$6)=C10),0),1)),\"Chưa vào\")","v":"Chưa vào"},{"$f":"IFERROR(CHOOSE($E$3,\nINDEX(INDIRECT('2. QT_LV'!$L$6),MATCH(1,(INDIRECT('2. QT_LV'!$D$6)=\"ON\")*(INDIRECT('2. QT_LV'!$H$6)=C10),0),1),\nINDEX(INDIRECT('2. QT_LV'!$L$6),MATCH(1,(INDIRECT('2. QT_LV'!$E$6)=\"ON\")*(INDIRECT('2. QT_LV'!$H$6)=C10),0),1),\nINDEX(INDIRECT('2. QT_LV'!$L$6),MATCH(1,(INDIRECT('2. QT_LV'!$F$6)=\"ON\")*(INDIRECT('2. QT_LV'!$H$6)=C10),0),1),\nINDEX(INDIRECT('2. QT_LV'!$L$6),MATCH(1,(INDIRECT('2. QT_LV'!$G$6)=\"ON\")*(INDIRECT('2. QT_LV'!$H$6)=C10),0),1)),\"Chưa vào\")","v":"Chưa vào"},{"$f":"IFERROR(CHOOSE($E$3,\nINDEX(INDIRECT('2. QT_LV'!$M$6),MATCH(1,(INDIRECT('2. QT_LV'!$D$6)=\"ON\")*(INDIRECT('2. QT_LV'!$H$6)=C10),0),1),\nINDEX(INDIRECT('2. QT_LV'!$M$6),MATCH(1,(INDIRECT('2. QT_LV'!$E$6)=\"ON\")*(INDIRECT('2. QT_LV'!$H$6)=C10),0),1),\nINDEX(INDIRECT('2. QT_LV'!$M$6),MATCH(1,(INDIRECT('2. QT_LV'!$F$6)=\"ON\")*(INDIRECT('2. QT_LV'!$H$6)=C10),0),1),\nINDEX(INDIRECT('2. QT_LV'!$M$6),MATCH(1,(INDIRECT('2. QT_LV'!$G$6)=\"ON\")*(INDIRECT('2. QT_LV'!$H$6)=C10),0),1)),\"Chưa vào\")","v":"Chưa vào"},{"$f":"IFERROR(CHOOSE($E$3,\nINDEX(INDIRECT('2. QT_LV'!$N$6),MATCH(1,(INDIRECT('2. QT_LV'!$D$6)=\"ON\")*(INDIRECT('2. QT_LV'!$H$6)=C10),0),1),\nINDEX(INDIRECT('2. QT_LV'!$N$6),MATCH(1,(INDIRECT('2. QT_LV'!$E$6)=\"ON\")*(INDIRECT('2. QT_LV'!$H$6)=C10),0),1),\nINDEX(INDIRECT('2. QT_LV'!$N$6),MATCH(1,(INDIRECT('2. QT_LV'!$F$6)=\"ON\")*(INDIRECT('2. QT_LV'!$H$6)=C10),0),1),\nINDEX(INDIRECT('2. QT_LV'!$N$6),MATCH(1,(INDIRECT('2. QT_LV'!$G$6)=\"ON\")*(INDIRECT('2. QT_LV'!$H$6)=C10),0),1)),\"Chưa vào\")","v":"Chưa vào"},{"$f":"IFERROR(INDEX(DSNV_Import!$D:$D,MATCH('3.TTNV'!$C10,DSNV_Import!$A:$A,0),1),\"\")","v":""},"",{"$f":"IFERROR(INDEX(DSNV_Import!$E:$E,MATCH('3.TTNV'!$C10,DSNV_Import!$A:$A,0),1),\"\")","v":""},{"$f":"IFERROR(INDEX(DSNV_Import!$F:$F,MATCH('3.TTNV'!$C10,DSNV_Import!$A:$A,0),1),\"\")","v":""},{"$f":"IFERROR(INDEX(DSNV_Import!$G:$G,MATCH('3.TTNV'!$C10,DSNV_Import!$A:$A,0),1),\"\")","v":""},{"$f":"IFERROR(INDEX(DSNV_Import!$H:$H,MATCH('3.TTNV'!$C10,DSNV_Import!$A:$A,0),1),\"\")","v":""},{"$f":"IFERROR(INDEX(DSNV_Import!$I:$I,MATCH('3.TTNV'!$C10,DSNV_Import!$A:$A,0),1),\"\")","v":""},{"$f":"IFERROR(INDEX(DSNV_Import!$J:$J,MATCH('3.TTNV'!$C10,DSNV_Import!$A:$A,0),1),\"\")","v":""},{"$f":"IFERROR(\nIF(INDEX(DSNV_Import!$K:$K,MATCH('3.TTNV'!$C10,DSNV_Import!$A:$A,0),1)=0,\"Chưa có TT\",INDEX(DSNV_Import!$K:$K,MATCH('3.TTNV'!$C10,DSNV_Import!$A:$A,0),1)),\"\")","v":""},{"$f":"IFERROR(\nIF(INDEX(DSNV_Import!$L:$L,MATCH('3.TTNV'!$C10,DSNV_Import!$A:$A,0),1)=0,\"Chưa có TT\",INDEX(DSNV_Import!$K:$K,MATCH('3.TTNV'!$C10,DSNV_Import!$A:$A,0),1)),\"\")","v":""},null,null,null,null,null,null,null,null,null,null,null,null,null,null,{"$f":"INDEX(INDIRECT('2. QT_LV'!$O$6),MATCH(1,\n(INDIRECT('2. QT_LV'!$H$6)=C10)*\n(INDIRECT('2. QT_LV'!$T$6)=\"Tăng mới\")*\n(INDIRECT('2. QT_LV'!$B$6)=_xlfn.MAXIFS(INDIRECT('2. QT_LV'!$B$6),INDIRECT('2. QT_LV'!$H$6),C10,INDIRECT('2. QT_LV'!$T$6),\"Tăng mới\")),\n0),1)","v":{"$error":"#N/A"}},{"$error":"#N/A"},{"$f":"('4.Report'!$L$4-AH10)/365","v":{"$error":"#N/A"}},null,null,null,null,null,null,{"$f":"IFERROR(INDEX(INDIRECT('2. QT_LV'!$O$6),MATCH(1,\n(INDIRECT('2. QT_LV'!$H$6)=C10)*\n(INDIRECT('2. QT_LV'!$U$6)=\"Nghỉ việc\")*\n(INDIRECT('2. QT_LV'!$B$6)=_xlfn.MAXIFS(INDIRECT('2. QT_LV'!$B$6),INDIRECT('2. QT_LV'!$H$6),C10,INDIRECT('2. QT_LV'!$U$6),\"Nghỉ việc\"))*\n(INDIRECT('2. QT_LV'!$O$6)>=AH10),0),1),\nDATE(2100,12,31))","v":"2100-12-31"},"31/12/2100",null,null,"0",11000000,0,11000000]
[4,{"$f":"IFERROR(CHOOSE($E$3,\nINDEX(INDIRECT('2. QT_LV'!$C$6),MATCH(1,(INDIRECT('2. QT_LV'!$D$6)=\"ON\")*(INDIRECT('2. QT_LV'!$H$6)=C11),0),1),\nINDEX(INDIRECT('2. QT_LV'!$C$6),MATCH(1,(INDIRECT('2. QT_LV'!$E$6)=\"ON\")*(INDIRECT('2. QT_LV'!$H$6)=C11),0),1),\nINDEX(INDIRECT('2. QT_LV'!$C$6),MATCH(1,(INDIRECT('2. QT_LV'!$F$6)=\"ON\")*(INDIRECT('2. QT_LV'!$H$6)=C11),0),1),\nINDEX(INDIRECT('2. QT_LV'!$C$6),MATCH(1,(INDIRECT('2. QT_LV'!$G$6)=\"ON\")*(INDIRECT('2. QT_LV'!$H$6)=C11),0),1)),\"Chưa vào\")","v":"Chưa vào"},{"$f":"DSNV_Import!A7","v":0},{"$f":"IFERROR(INDEX(DSNV_Import!$B:$B,MATCH('3.TTNV'!$C11,DSNV_Import!$A:$A,0),1),\"\")","v":""},{"$f":"IFERROR(INDEX(DSNV_Import!$C:$C,MATCH('3.TTNV'!$C11,DSNV_Import!$A:$A,0),1),\"\")","v":""},{"$f":"IFERROR(CHOOSE($E$3,\nINDEX(INDIRECT('2. QT_LV'!$K$6),MATCH(1,(INDIRECT('2. QT_LV'!$D$6)=\"ON\")*(INDIRECT('2. QT_LV'!$H$6)=C11),0),1),\nINDEX(INDIRECT('2. QT_LV'!$K$6),MATCH(1,(INDIRECT('2. QT_LV'!$E$6)=\"ON\")*(INDIRECT('2. QT_LV'!$H$6)=C11),0),1),\nINDEX(INDIRECT('2. QT_LV'!$K$6),MATCH(1,(INDIRECT('2. QT_LV'!$F$6)=\"ON\")*(INDIRECT('2. QT_LV'!$H$6)=C11),0),1),\nINDEX(INDIRECT('2. QT_LV'!$K$6),MATCH(1,(INDIRECT('2. QT_LV'!$G$6)=\"ON\")*(INDIRECT('2. QT_LV'!$H$6)=C11),0),1)),\"Chưa vào\")","v":"Chưa vào"},{"$f":"IFERROR(CHOOSE($E$3,\nINDEX(INDIRECT('2. QT_LV'!$L$6),MATCH(1,(INDIRECT('2. QT_LV'!$D$6)=\"ON\")*(INDIRECT('2. QT_LV'!$H$6)=C11),0),1),\nINDEX(INDIRECT('2. QT_LV'!$L$6),MATCH(1,(INDIRECT('2. QT_LV'!$E$6)=\"ON\")*(INDIRECT('2. QT_LV'!$H$6)=C11),0),1),\nINDEX(INDIRECT('2. QT_LV'!$L$6),MATCH(1,(INDIRECT('2. QT_LV'!$F$6)=\"ON\")*(INDIRECT('2. QT_LV'!$H$6)=C11),0),1),\nINDEX(INDIRECT('2. QT_LV'!$L$6),MATCH(1,(INDIRECT('2. QT_LV'!$G$6)=\"ON\")*(INDIRECT('2. QT_LV'!$H$6)=C11),0),1)),\"Chưa vào\")","v":"Chưa vào"},{"$f":"IFERROR(CHOOSE($E$3,\nINDEX(INDIRECT('2. QT_LV'!$M$6),MATCH(1,(INDIRECT('2. QT_LV'!$D$6)=\"ON\")*(INDIRECT('2. QT_LV'!$H$6)=C11),0),1),\nINDEX(INDIRECT('2. QT_LV'!$M$6),MATCH(1,(INDIRECT('2. QT_LV'!$E$6)=\"ON\")*(INDIRECT('2. QT_LV'!$H$6)=C11),0),1),\nINDEX(INDIRECT('2. QT_LV'!$M$6),MATCH(1,(INDIRECT('2. QT_LV'!$F$6)=\"ON\")*(INDIRECT('2. QT_LV'!$H$6)=C11),0),1),\nINDEX(INDIRECT('2. QT_LV'!$M$6),MATCH(1,(INDIRECT('2. QT_LV'!$G$6)=\"ON\")*(INDIRECT('2. QT_LV'!$H$6)=C11),0),1)),\"Chưa vào\")","v":"Chưa vào"},{"$f":"IFERROR(CHOOSE($E$3,\nINDEX(INDIRECT('2. QT_LV'!$N$6),MATCH(1,(INDIRECT('2. QT_LV'!$D$6)=\"ON\")*(INDIRECT('2. QT_LV'!$H$6)=C11),0),1),\nINDEX(INDIRECT('2. QT_LV'!$N$6),MATCH(1,(INDIRECT('2. QT_LV'!$E$6)=\"ON\")*(INDIRECT('2. QT_LV'!$H$6)=C11),0),1),\nINDEX(INDIRECT('2. QT_LV'!$N$6),MATCH(1,(INDIRECT('2. QT_LV'!$F$6)=\"ON\")*(INDIRECT('2. QT_LV'!$H$6)=C11),0),1),\nINDEX(INDIRECT('2. QT_LV'!$N$6),MATCH(1,(INDIRECT('2. QT_LV'!$G$6)=\"ON\")*(INDIRECT('2. QT_LV'!$H$6)=C11),0),1)),\"Chưa vào\")","v":"Chưa vào"},{"$f":"IFERROR(INDEX(DSNV_Import!$D:$D,MATCH('3.TTNV'!$C11,DSNV_Import!$A:$A,0),1),\"\")","v":""},"",{"$f":"IFERROR(INDEX(DSNV_Import!$E:$E,MATCH('3.TTNV'!$C11,DSNV_Import!$A:$A,0),1),\"\")","v":""},{"$f":"IFERROR(INDEX(DSNV_Import!$F:$F,MATCH('3.TTNV'!$C11,DSNV_Import!$A:$A,0),1),\"\")","v":""},{"$f":"IFERROR(INDEX(DSNV_Import!$G:$G,MATCH('3.TTNV'!$C11,DSNV_Import!$A:$A,0),1),\"\")","v":""},{"$f":"IFERROR(INDEX(DSNV_Import!$H:$H,MATCH('3.TTNV'!$C11,DSNV_Import!$A:$A,0),1),\"\")","v":""},{"$f":"IFERROR(INDEX(DSNV_Import!$I:$I,MATCH('3.TTNV'!$C11,DSNV_Import!$A:$A,0),1),\"\")","v":""},{"$f":"IFERROR(INDEX(DSNV_Import!$J:$J,MATCH('3.TTNV'!$C11,DSNV_Import!$A:$A,0),1),\"\")","v":""},{"$f":"IFERROR(\nIF(INDEX(DSNV_Import!$K:$K,MATCH('3.TTNV'!$C11,DSNV_Import!$A:$A,0),1)=0,\"Chưa có TT\",INDEX(DSNV_Import!$K:$K,MATCH('3.TTNV'!$C11,DSNV_Import!$A:$A,0),1)),\"\")","v":""},{"$f":"IFERROR(\nIF(INDEX(DSNV_Import!$L:$L,MATCH('3.TTNV'!$C11,DSNV_Import!$A:$A,0),1)=0,\"Chưa có TT\",INDEX(DSNV_Import!$K:$K,MATCH('3.TTNV'!$C11,DSNV_Import!$A:$A,0),1)),\"\")","v":""},null,null,null,null,null,null,null,null,null,null,null,null,null,null,{"$f":"INDEX(INDIRECT('2. QT_LV'!$O$6),MATCH(1,\n(INDIRECT('2. QT_LV'!$H$6)=C11)*\n(INDIRECT('2. QT_LV'!$T$6)=\"Tăng mới\")*\n(INDIRECT('2. QT_LV'!$B$6)=_xlfn.MAXIFS(INDIRECT('2. QT_LV'!$B$6),INDIRECT('2. QT_LV'!$H$6),C11,INDIRECT('2. QT_LV'!$T$6),\"Tăng mới\")),\n0),1)","v":{"$error":"#N/A"}},{"$error":"#N/A"},{"$f":"('4.Report'!$L$4-AH11)/365","v":{"$error":"#N/A"}},null,null,null,null,null,null,{"$f":"IFERROR(INDEX(INDIRECT('2. QT_LV'!$O$6),MATCH(1,\n(INDIRECT('2. QT_LV'!$H$6)=C11)*\n(INDIRECT('2. QT_LV'!$U$6)=\"Nghỉ việc\")*\n(INDIRECT('2. QT_LV'!$B$6)=_xlfn.MAXIFS(INDIRECT('2. QT_LV'!$B$6),INDIRECT('2. QT_LV'!$H$6),C11,INDIRECT('2. QT_LV'!$U$6),\"Nghỉ việc\"))*\n(INDIRECT('2. QT_LV'!$O$6)>=AH11),0),1),\nDATE(2100,12,31))","v":"2100-12-31"},"31/12/2100",null,null,"0",11000000,0,11000000]
[5,{"$f":"IFERROR(CHOOSE($E$3,\nINDEX(INDIRECT('2. QT_LV'!$C$6),MATCH(1,(INDIRECT('2. QT_LV'!$D$6)=\"ON\")*(INDIRECT('2. QT_LV'!$H$6)=C12),0),1),\nINDEX(INDIRECT('2. QT_LV'!$C$6),MATCH(1,(INDIRECT('2. QT_LV'!$E$6)=\"ON\")*(INDIRECT('2. QT_LV'!$H$6)=C12),0),1),\nINDEX(INDIRECT('2. QT_LV'!$C$6),MATCH(1,(INDIRECT('2. QT_LV'!$F$6)=\"ON\")*(INDIRECT('2. QT_LV'!$H$6)=C12),0),1),\nINDEX(INDIRECT('2. QT_LV'!$C$6),MATCH(1,(INDIRECT('2. QT_LV'!$G$6)=\"ON\")*(INDIRECT('2. QT_LV'!$H$6)=C12),0),1)),\"Chưa vào\")","v":"Chưa vào"},{"$f":"DSNV_Import!A8","v":0},{"$f":"IFERROR(INDEX(DSNV_Import!$B:$B,MATCH('3.TTNV'!$C12,DSNV_Import!$A:$A,0),1),\"\")","v":""},{"$f":"IFERROR(INDEX(DSNV_Import!$C:$C,MATCH('3.TTNV'!$C12,DSNV_Import!$A:$A,0),1),\"\")","v":""},{"$f":"IFERROR(CHOOSE($E$3,\nINDEX(INDIRECT('2. QT_LV'!$K$6),MATCH(1,(INDIRECT('2. QT_LV'!$D$6)=\"ON\")*(INDIRECT('2. QT_LV'!$H$6)=C12),0),1),\nINDEX(INDIRECT('2. QT_LV'!$K$6),MATCH(1,(INDIRECT('2. QT_LV'!$E$6)=\"ON\")*(INDIRECT('2. QT_LV'!$H$6)=C12),0),1),\nINDEX(INDIRECT('2. QT_LV'!$K$6),MATCH(1,(INDIRECT('2. QT_LV'!$F$6)=\"ON\")*(INDIRECT('2. QT_LV'!$H$6)=C12),0),1),\nINDEX(INDIRECT('2. QT_LV'!$K$6),MATCH(1,(INDIRECT('2. QT_LV'!$G$6)=\"ON\")*(INDIRECT('2. QT_LV'!$H$6)=C12),0),1)),\"Chưa vào\")","v":"Chưa vào"},{"$f":"IFERROR(CHOOSE($E$3,\nINDEX(INDIRECT('2. QT_LV'!$L$6),MATCH(1,(INDIRECT('2. QT_LV'!$D$6)=\"ON\")*(INDIRECT('2. QT_LV'!$H$6)=C12),0),1),\nINDEX(INDIRECT('2. QT_LV'!$L$6),MATCH(1,(INDIRECT('2. QT_LV'!$E$6)=\"ON\")*(INDIRECT('2. QT_LV'!$H$6)=C12),0),1),\nINDEX(INDIRECT('2. QT_LV'!$L$6),MATCH(1,(INDIRECT('2. QT_LV'!$F$6)=\"ON\")*(INDIRECT('2. QT_LV'!$H$6)=C12),0),1),\nINDEX(INDIRECT('2. QT_LV'!$L$6),MATCH(1,(INDIRECT('2. QT_LV'!$G$6)=\"ON\")*(INDIRECT('2. QT_LV'!$H$6)=C12),0),1)),\"Chưa vào\")","v":"Chưa vào"},{"$f":"IFERROR(CHOOSE($E$3,\nINDEX(INDIRECT('2. QT_LV'!$M$6),MATCH(1,(INDIRECT('2. QT_LV'!$D$6)=\"ON\")*(INDIRECT('2. QT_LV'!$H$6)=C12),0),1),\nINDEX(INDIRECT('2. QT_LV'!$M$6),MATCH(1,(INDIRECT('2. QT_LV'!$E$6)=\"ON\")*(INDIRECT('2. QT_LV'!$H$6)=C12),0),1),\nINDEX(INDIRECT('2. QT_LV'!$M$6),MATCH(1,(INDIRECT('2. QT_LV'!$F$6)=\"ON\")*(INDIRECT('2. QT_LV'!$H$6)=C12),0),1),\nINDEX(INDIRECT('2. QT_LV'!$M$6),MATCH(1,(INDIRECT('2. QT_LV'!$G$6)=\"ON\")*(INDIRECT('2. QT_LV'!$H$6)=C12),0),1)),\"Chưa vào\")","v":"Chưa vào"},{"$f":"IFERROR(CHOOSE($E$3,\nINDEX(INDIRECT('2. QT_LV'!$N$6),MATCH(1,(INDIRECT('2. QT_LV'!$D$6)=\"ON\")*(INDIRECT('2. QT_LV'!$H$6)=C12),0),1),\nINDEX(INDIRECT('2. QT_LV'!$N$6),MATCH(1,(INDIRECT('2. QT_LV'!$E$6)=\"ON\")*(INDIRECT('2. QT_LV'!$H$6)=C12),0),1),\nINDEX(INDIRECT('2. QT_LV'!$N$6),MATCH(1,(INDIRECT('2. QT_LV'!$F$6)=\"ON\")*(INDIRECT('2. QT_LV'!$H$6)=C12),0),1),\nINDEX(INDIRECT('2. QT_LV'!$N$6),MATCH(1,(INDIRECT('2. QT_LV'!$G$6)=\"ON\")*(INDIRECT('2. QT_LV'!$H$6)=C12),0),1)),\"Chưa vào\")","v":"Chưa vào"},{"$f":"IFERROR(INDEX(DSNV_Import!$D:$D,MATCH('3.TTNV'!$C12,DSNV_Import!$A:$A,0),1),\"\")","v":""},"",{"$f":"IFERROR(INDEX(DSNV_Import!$E:$E,MATCH('3.TTNV'!$C12,DSNV_Import!$A:$A,0),1),\"\")","v":""},{"$f":"IFERROR(INDEX(DSNV_Import!$F:$F,MATCH('3.TTNV'!$C12,DSNV_Import!$A:$A,0),1),\"\")","v":""},{"$f":"IFERROR(INDEX(DSNV_Import!$G:$G,MATCH('3.TTNV'!$C12,DSNV_Import!$A:$A,0),1),\"\")","v":""},{"$f":"IFERROR(INDEX(DSNV_Import!$H:$H,MATCH('3.TTNV'!$C12,DSNV_Import!$A:$A,0),1),\"\")","v":""},{"$f":"IFERROR(INDEX(DSNV_Import!$I:$I,MATCH('3.TTNV'!$C12,DSNV_Import!$A:$A,0),1),\"\")","v":""},{"$f":"IFERROR(INDEX(DSNV_Import!$J:$J,MATCH('3.TTNV'!$C12,DSNV_Import!$A:$A,0),1),\"\")","v":""},{"$f":"IFERROR(\nIF(INDEX(DSNV_Import!$K:$K,MATCH('3.TTNV'!$C12,DSNV_Import!$A:$A,0),1)=0,\"Chưa có TT\",INDEX(DSNV_Import!$K:$K,MATCH('3.TTNV'!$C12,DSNV_Import!$A:$A,0),1)),\"\")","v":""},{"$f":"IFERROR(\nIF(INDEX(DSNV_Import!$L:$L,MATCH('3.TTNV'!$C12,DSNV_Import!$A:$A,0),1)=0,\"Chưa có TT\",INDEX(DSNV_Import!$K:$K,MATCH('3.TTNV'!$C12,DSNV_Import!$A:$A,0),1)),\"\")","v":""},null,null,null,null,null,null,null,null,null,null,null,null,null,null,{"$f":"INDEX(INDIRECT('2. QT_LV'!$O$6),MATCH(1,\n(INDIRECT('2. QT_LV'!$H$6)=C12)*\n(INDIRECT('2. QT_LV'!$T$6)=\"Tăng mới\")*\n(INDIRECT('2. QT_LV'!$B$6)=_xlfn.MAXIFS(INDIRECT('2. QT_LV'!$B$6),INDIRECT('2. QT_LV'!$H$6),C12,INDIRECT('2. QT_LV'!$T$6),\"Tăng mới\")),\n0),1)","v":{"$error":"#N/A"}},{"$error":"#N/A"},{"$f":"('4.Report'!$L$4-AH12)/365","v":{"$error":"#N/A"}},null,null,null,null,null,null,{"$f":"IFERROR(INDEX(INDIRECT('2. QT_LV'!$O$6),MATCH(1,\n(INDIRECT('2. QT_LV'!$H$6)=C12)*\n(INDIRECT('2. QT_LV'!$U$6)=\"Nghỉ việc\")*\n(INDIRECT('2. QT_LV'!$B$6)=_xlfn.MAXIFS(INDIRECT('2. QT_LV'!$B$6),INDIRECT('2. QT_LV'!$H$6),C12,INDIRECT('2. QT_LV'!$U$6),\"Nghỉ việc\"))*\n(INDIRECT('2. QT_LV'!$O$6)>=AH12),0),1),\nDATE(2100,12,31))","v":"2100-12-31"},"31/12/2100",null,null,"0",11000000,0,11000000]
[6,{"$f":"IFERROR(CHOOSE($E$3,\nINDEX(INDIRECT('2. QT_LV'!$C$6),MATCH(1,(INDIRECT('2. QT_LV'!$D$6)=\"ON\")*(INDIRECT('2. QT_LV'!$H$6)=C13),0),1),\nINDEX(INDIRECT('2. QT_LV'!$C$6),MATCH(1,(INDIRECT('2. QT_LV'!$E$6)=\"ON\")*(INDIRECT('2. QT_LV'!$H$6)=C13),0),1),\nINDEX(INDIRECT('2. QT_LV'!$C$6),MATCH(1,(INDIRECT('2. QT_LV'!$F$6)=\"ON\")*(INDIRECT('2. QT_LV'!$H$6)=C13),0),1),\nINDEX(INDIRECT('2. QT_LV'!$C$6),MATCH(1,(INDIRECT('2. QT_LV'!$G$6)=\"ON\")*(INDIRECT('2. QT_LV'!$H$6)=C13),0),1)),\"Chưa vào\")","v":"Chưa vào"},{"$f":"DSNV_Import!A9","v":0},{"$f":"IFERROR(INDEX(DSNV_Import!$B:$B,MATCH('3.TTNV'!$C13,DSNV_Import!$A:$A,0),1),\"\")","v":""},{"$f":"IFERROR(INDEX(DSNV_Import!$C:$C,MATCH('3.TTNV'!$C13,DSNV_Import!$A:$A,0),1),\"\")","v":""},{"$f":"IFERROR(CHOOSE($E$3,\nINDEX(INDIRECT('2. QT_LV'!$K$6),MATCH(1,(INDIRECT('2. QT_LV'!$D$6)=\"ON\")*(INDIRECT('2. QT_LV'!$H$6)=C13),0),1),\nINDEX(INDIRECT('2. QT_LV'!$K$6),MATCH(1,(INDIRECT('2. QT_LV'!$E$6)=\"ON\")*(INDIRECT('2. QT_LV'!$H$6)=C13),0),1),\nINDEX(INDIRECT('2. QT_LV'!$K$6),MATCH(1,(INDIRECT('2. QT_LV'!$F$6)=\"ON\")*(INDIRECT('2. QT_LV'!$H$6)=C13),0),1),\nINDEX(INDIRECT('2. QT_LV'!$K$6),MATCH(1,(INDIRECT('2. QT_LV'!$G$6)=\"ON\")*(INDIRECT('2. QT_LV'!$H$6)=C13),0),1)),\"Chưa vào\")","v":"Chưa vào"},{"$f":"IFERROR(CHOOSE($E$3,\nINDEX(INDIRECT('2. QT_LV'!$L$6),MATCH(1,(INDIRECT('2. QT_LV'!$D$6)=\"ON\")*(INDIRECT('2. QT_LV'!$H$6)=C13),0),1),\nINDEX(INDIRECT('2. QT_LV'!$L$6),MATCH(1,(INDIRECT('2. QT_LV'!$E$6)=\"ON\")*(INDIRECT('2. QT_LV'!$H$6)=C13),0),1),\nINDEX(INDIRECT('2. QT_LV'!$L$6),MATCH(1,(INDIRECT('2. QT_LV'!$F$6)=\"ON\")*(INDIRECT('2. QT_LV'!$H$6)=C13),0),1),\nINDEX(INDIRECT('2. QT_LV'!$L$6),MATCH(1,(INDIRECT('2. QT_LV'!$G$6)=\"ON\")*(INDIRECT('2. QT_LV'!$H$6)=C13),0),1)),\"Chưa vào\")","v":"Chưa vào"},{"$f":"IFERROR(CHOOSE($E$3,\nINDEX(INDIRECT('2. QT_LV'!$M$6),MATCH(1,(INDIRECT('2. QT_LV'!$D$6)=\"ON\")*(INDIRECT('2. QT_LV'!$H$6)=C13),0),1),\nINDEX(INDIRECT('2. QT_LV'!$M$6),MATCH(1,(INDIRECT('2. QT_LV'!$E$6)=\"ON\")*(INDIRECT('2. QT_LV'!$H$6)=C13),0),1),\nINDEX(INDIRECT('2. QT_LV'!$M$6),MATCH(1,(INDIRECT('2. QT_LV'!$F$6)=\"ON\")*(INDIRECT('2. QT_LV'!$H$6)=C13),0),1),\nINDEX(INDIRECT('2. QT_LV'!$M$6),MATCH(1,(INDIRECT('2. QT_LV'!$G$6)=\"ON\")*(INDIRECT('2. QT_LV'!$H$6)=C13),0),1)),\"Chưa vào\")","v":"Chưa vào"},{"$f":"IFERROR(CHOOSE($E$3,\nINDEX(INDIRECT('2. QT_LV'!$N$6),MATCH(1,(INDIRECT('2. QT_LV'!$D$6)=\"ON\")*(INDIRECT('2. QT_LV'!$H$6)=C13),0),1),\nINDEX(INDIRECT('2. QT_LV'!$N$6),MATCH(1,(INDIRECT('2. QT_LV'!$E$6)=\"ON\")*(INDIRECT('2. QT_LV'!$H$6)=C13),0),1),\nINDEX(INDIRECT('2. QT_LV'!$N$6),MATCH(1,(INDIRECT('2. QT_LV'!$F$6)=\"ON\")*(INDIRECT('2. QT_LV'!$H$6)=C13),0),1),\nINDEX(INDIRECT('2. QT_LV'!$N$6),MATCH(1,(INDIRECT('2. QT_LV'!$G$6)=\"ON\")*(INDIRECT('2. QT_LV'!$H$6)=C13),0),1)),\"Chưa vào\")","v":"Chưa vào"},{"$f":"IFERROR(INDEX(DSNV_Import!$D:$D,MATCH('3.TTNV'!$C13,DSNV_Import!$A:$A,0),1),\"\")","v":""},"",{"$f":"IFERROR(INDEX(DSNV_Import!$E:$E,MATCH('3.TTNV'!$C13,DSNV_Import!$A:$A,0),1),\"\")","v":""},{"$f":"IFERROR(INDEX(DSNV_Import!$F:$F,MATCH('3.TTNV'!$C13,DSNV_Import!$A:$A,0),1),\"\")","v":""},{"$f":"IFERROR(INDEX(DSNV_Import!$G:$G,MATCH('3.TTNV'!$C13,DSNV_Import!$A:$A,0),1),\"\")","v":""},{"$f":"IFERROR(INDEX(DSNV_Import!$H:$H,MATCH('3.TTNV'!$C13,DSNV_Import!$A:$A,0),1),\"\")","v":""},{"$f":"IFERROR(INDEX(DSNV_Import!$I:$I,MATCH('3.TTNV'!$C13,DSNV_Import!$A:$A,0),1),\"\")","v":""},{"$f":"IFERROR(INDEX(DSNV_Import!$J:$J,MATCH('3.TTNV'!$C13,DSNV_Import!$A:$A,0),1),\"\")","v":""},{"$f":"IFERROR(\nIF(INDEX(DSNV_Import!$K:$K,MATCH('3.TTNV'!$C13,DSNV_Import!$A:$A,0),1)=0,\"Chưa có TT\",INDEX(DSNV_Import!$K:$K,MATCH('3.TTNV'!$C13,DSNV_Import!$A:$A,0),1)),\"\")","v":""},{"$f":"IFERROR(\nIF(INDEX(DSNV_Import!$L:$L,MATCH('3.TTNV'!$C13,DSNV_Import!$A:$A,0),1)=0,\"Chưa có TT\",INDEX(DSNV_Import!$K:$K,MATCH('3.TTNV'!$C13,DSNV_Import!$A:$A,0),1)),\"\")","v":""},null,null,null,null,null,null,null,null,null,null,null,null,null,null,{"$f":"INDEX(INDIRECT('2. QT_LV'!$O$6),MATCH(1,\n(INDIRECT('2. QT_LV'!$H$6)=C13)*\n(INDIRECT('2. QT_LV'!$T$6)=\"Tăng mới\")*\n(INDIRECT('2. QT_LV'!$B$6)=_xlfn.MAXIFS(INDIRECT('2. QT_LV'!$B$6),INDIRECT('2. QT_LV'!$H$6),C13,INDIRECT('2. QT_LV'!$T$6),\"Tăng mới\")),\n0),1)","v":{"$error":"#N/A"}},{"$f":"TEXT(DAY(AH13),\"00\")&\"/\"&TEXT(MONTH(AH13),\"00\")&\"/\"&YEAR(AH13)","v":{"$error":"#N/A"}},{"$f":"('4.Report'!$L$4-AH13)/365","v":{"$error":"#N/A"}},null,null,null,null,null,null,{"$f":"IFERROR(INDEX(INDIRECT('2. QT_LV'!$O$6),MATCH(1,\n(INDIRECT('2. QT_LV'!$H$6)=C13)*\n(INDIRECT('2. QT_LV'!$U$6)=\"Nghỉ việc\")*\n(INDIRECT('2. QT_LV'!$B$6)=_xlfn.MAXIFS(INDIRECT('2. QT_LV'!$B$6),INDIRECT('2. QT_LV'!$H$6),C13,INDIRECT('2. QT_LV'!$U$6),\"Nghỉ việc\"))*\n(INDIRECT('2. QT_LV'!$O$6)>=AH13),0),1),\nDATE(2100,12,31))","v":"2100-12-31"},{"$f":"TEXT(DAY(AQ13),\"00\")&\"/\"&TEXT(MONTH(AQ13),\"00\")&\"/\"&YEAR(AQ13)","v":"31/12/2100"},null,null,"0",11000000,0,{"$f":"AV13+AW13","v":11000000}]
[7,{"$f":"IFERROR(CHOOSE($E$3,\nINDEX(INDIRECT('2. QT_LV'!$C$6),MATCH(1,(INDIRECT('2. QT_LV'!$D$6)=\"ON\")*(INDIRECT('2. QT_LV'!$H$6)=C14),0),1),\nINDEX(INDIRECT('2. QT_LV'!$C$6),MATCH(1,(INDIRECT('2. QT_LV'!$E$6)=\"ON\")*(INDIRECT('2. QT_LV'!$H$6)=C14),0),1),\nINDEX(INDIRECT('2. QT_LV'!$C$6),MATCH(1,(INDIRECT('2. QT_LV'!$F$6)=\"ON\")*(INDIRECT('2. QT_LV'!$H$6)=C14),0),1),\nINDEX(INDIRECT('2. QT_LV'!$C$6),MATCH(1,(INDIRECT('2. QT_LV'!$G$6)=\"ON\")*(INDIRECT('2. QT_LV'!$H$6)=C14),0),1)),\"Chưa vào\")","v":"Chưa vào"},{"$f":"DSNV_Import!A10","v":0},{"$f":"IFERROR(INDEX(DSNV_Import!$B:$B,MATCH('3.TTNV'!$C14,DSNV_Import!$A:$A,0),1),\"\")","v":""},{"$f":"IFERROR(INDEX(DSNV_Import!$C:$C,MATCH('3.TTNV'!$C14,DSNV_Import!$A:$A,0),1),\"\")","v":""},{"$f":"IFERROR(CHOOSE($E$3,\nINDEX(INDIRECT('2. QT_LV'!$K$6),MATCH(1,(INDIRECT('2. QT_LV'!$D$6)=\"ON\")*(INDIRECT('2. QT_LV'!$H$6)=C14),0),1),\nINDEX(INDIRECT('2. QT_LV'!$K$6),MATCH(1,(INDIRECT('2. QT_LV'!$E$6)=\"ON\")*(INDIRECT('2. QT_LV'!$H$6)=C14),0),1),\nINDEX(INDIRECT('2. QT_LV'!$K$6),MATCH(1,(INDIRECT('2. QT_LV'!$F$6)=\"ON\")*(INDIRECT('2. QT_LV'!$H$6)=C14),0),1),\nINDEX(INDIRECT('2. QT_LV'!$K$6),MATCH(1,(INDIRECT('2. QT_LV'!$G$6)=\"ON\")*(INDIRECT('2. QT_LV'!$H$6)=C14),0),1)),\"Chưa vào\")","v":"Chưa vào"},{"$f":"IFERROR(CHOOSE($E$3,\nINDEX(INDIRECT('2. QT_LV'!$L$6),MATCH(1,(INDIRECT('2. QT_LV'!$D$6)=\"ON\")*(INDIRECT('2. QT_LV'!$H$6)=C14),0),1),\nINDEX(INDIRECT('2. QT_LV'!$L$6),MATCH(1,(INDIRECT('2. QT_LV'!$E$6)=\"ON\")*(INDIRECT('2. QT_LV'!$H$6)=C14),0),1),\nINDEX(INDIRECT('2. QT_LV'!$L$6),MATCH(1,(INDIRECT('2. QT_LV'!$F$6)=\"ON\")*(INDIRECT('2. QT_LV'!$H$6)=C14),0),1),\nINDEX(INDIRECT('2. QT_LV'!$L$6),MATCH(1,(INDIRECT('2. QT_LV'!$G$6)=\"ON\")*(INDIRECT('2. QT_LV'!$H$6)=C14),0),1)),\"Chưa vào\")","v":"Chưa vào"},{"$f":"IFERROR(CHOOSE($E$3,\nINDEX(INDIRECT('2. QT_LV'!$M$6),MATCH(1,(INDIRECT('2. QT_LV'!$D$6)=\"ON\")*(INDIRECT('2. QT_LV'!$H$6)=C14),0),1),\nINDEX(INDIRECT('2. QT_LV'!$M$6),MATCH(1,(INDIRECT('2. QT_LV'!$E$6)=\"ON\")*(INDIRECT('2. QT_LV'!$H$6)=C14),0),1),\nINDEX(INDIRECT('2. QT_LV'!$M$6),MATCH(1,(INDIRECT('2. QT_LV'!$F$6)=\"ON\")*(INDIRECT('2. QT_LV'!$H$6)=C14),0),1),\nINDEX(INDIRECT('2. QT_LV'!$M$6),MATCH(1,(INDIRECT('2. QT_LV'!$G$6)=\"ON\")*(INDIRECT('2. QT_LV'!$H$6)=C14),0),1)),\"Chưa vào\")","v":"Chưa vào"},{"$f":"IFERROR(CHOOSE($E$3,\nINDEX(INDIRECT('2. QT_LV'!$N$6),MATCH(1,(INDIRECT('2. QT_LV'!$D$6)=\"ON\")*(INDIRECT('2. QT_LV'!$H$6)=C14),0),1),\nINDEX(INDIRECT('2. QT_LV'!$N$6),MATCH(1,(INDIRECT('2. QT_LV'!$E$6)=\"ON\")*(INDIRECT('2. QT_LV'!$H$6)=C14),0),1),\nINDEX(INDIRECT('2. QT_LV'!$N$6),MATCH(1,(INDIRECT('2. QT_LV'!$F$6)=\"ON\")*(INDIRECT('2. QT_LV'!$H$6)=C14),0),1),\nINDEX(INDIRECT('2. QT_LV'!$N$6),MATCH(1,(INDIRECT('2. QT_LV'!$G$6)=\"ON\")*(INDIRECT('2. QT_LV'!$H$6)=C14),0),1)),\"Chưa vào\")","v":"Chưa vào"},{"$f":"IFERROR(INDEX(DSNV_Import!$D:$D,MATCH('3.TTNV'!$C14,DSNV_Import!$A:$A,0),1),\"\")","v":""},"",{"$f":"IFERROR(INDEX(DSNV_Import!$E:$E,MATCH('3.TTNV'!$C14,DSNV_Import!$A:$A,0),1),\"\")","v":""},{"$f":"IFERROR(INDEX(DSNV_Import!$F:$F,MATCH('3.TTNV'!$C14,DSNV_Import!$A:$A,0),1),\"\")","v":""},{"$f":"IFERROR(INDEX(DSNV_Import!$G:$G,MATCH('3.TTNV'!$C14,DSNV_Import!$A:$A,0),1),\"\")","v":""},{"$f":"IFERROR(INDEX(DSNV_Import!$H:$H,MATCH('3.TTNV'!$C14,DSNV_Import!$A:$A,0),1),\"\")","v":""},{"$f":"IFERROR(INDEX(DSNV_Import!$I:$I,MATCH('3.TTNV'!$C14,DSNV_Import!$A:$A,0),1),\"\")","v":""},{"$f":"IFERROR(INDEX(DSNV_Import!$J:$J,MATCH('3.TTNV'!$C14,DSNV_Import!$A:$A,0),1),\"\")","v":""},{"$f":"IFERROR(\nIF(INDEX(DSNV_Import!$K:$K,MATCH('3.TTNV'!$C14,DSNV_Import!$A:$A,0),1)=0,\"Chưa có TT\",INDEX(DSNV_Import!$K:$K,MATCH('3.TTNV'!$C14,DSNV_Import!$A:$A,0),1)),\"\")","v":""},{"$f":"IFERROR(\nIF(INDEX(DSNV_Import!$L:$L,MATCH('3.TTNV'!$C14,DSNV_Import!$A:$A,0),1)=0,\"Chưa có TT\",INDEX(DSNV_Import!$K:$K,MATCH('3.TTNV'!$C14,DSNV_Import!$A:$A,0),1)),\"\")","v":""},null,null,null,null,null,null,null,null,null,null,null,null,null,null,{"$f":"INDEX(INDIRECT('2. QT_LV'!$O$6),MATCH(1,\n(INDIRECT('2. QT_LV'!$H$6)=C14)*\n(INDIRECT('2. QT_LV'!$T$6)=\"Tăng mới\")*\n(INDIRECT('2. QT_LV'!$B$6)=_xlfn.MAXIFS(INDIRECT('2. QT_LV'!$B$6),INDIRECT('2. QT_LV'!$H$6),C14,INDIRECT('2. QT_LV'!$T$6),\"Tăng mới\")),\n0),1)","v":{"$error":"#N/A"}},{"$error":"#N/A"},{"$f":"('4.Report'!$L$4-AH14)/365","v":{"$error":"#N/A"}},null,null,null,null,null,null,{"$f":"IFERROR(INDEX(INDIRECT('2. QT_LV'!$O$6),MATCH(1,\n(INDIRECT('2. QT_LV'!$H$6)=C14)*\n(INDIRECT('2. QT_LV'!$U$6)=\"Nghỉ việc\")*\n(INDIRECT('2. QT_LV'!$B$6)=_xlfn.MAXIFS(INDIRECT('2. QT_LV'!$B$6),INDIRECT('2. QT_LV'!$H$6),C14,INDIRECT('2. QT_LV'!$U$6),\"Nghỉ việc\"))*\n(INDIRECT('2. QT_LV'!$O$6)>=AH14),0),1),\nDATE(2100,12,31))","v":"2100-12-31"},"31/12/2100",null,null,"0",11000000,0,11000000]
[8,{"$f":"IFERROR(CHOOSE($E$3,\nINDEX(INDIRECT('2. QT_LV'!$C$6),MATCH(1,(INDIRECT('2. QT_LV'!$D$6)=\"ON\")*(INDIRECT('2. QT_LV'!$H$6)=C15),0),1),\nINDEX(INDIRECT('2. QT_LV'!$C$6),MATCH(1,(INDIRECT('2. QT_LV'!$E$6)=\"ON\")*(INDIRECT('2. QT_LV'!$H$6)=C15),0),1),\nINDEX(INDIRECT('2. QT_LV'!$C$6),MATCH(1,(INDIRECT('2. QT_LV'!$F$6)=\"ON\")*(INDIRECT('2. QT_LV'!$H$6)=C15),0),1),\nINDEX(INDIRECT('2. QT_LV'!$C$6),MATCH(1,(INDIRECT('2. QT_LV'!$G$6)=\"ON\")*(INDIRECT('2. QT_LV'!$H$6)=C15),0),1)),\"Chưa vào\")","v":"Chưa vào"},{"$f":"DSNV_Import!A11","v":0},{"$f":"IFERROR(INDEX(DSNV_Import!$B:$B,MATCH('3.TTNV'!$C15,DSNV_Import!$A:$A,0),1),\"\")","v":""},{"$f":"IFERROR(INDEX(DSNV_Import!$C:$C,MATCH('3.TTNV'!$C15,DSNV_Import!$A:$A,0),1),\"\")","v":""},{"$f":"IFERROR(CHOOSE($E$3,\nINDEX(INDIRECT('2. QT_LV'!$K$6),MATCH(1,(INDIRECT('2. QT_LV'!$D$6)=\"ON\")*(INDIRECT('2. QT_LV'!$H$6)=C15),0),1),\nINDEX(INDIRECT('2. QT_LV'!$K$6),MATCH(1,(INDIRECT('2. QT_LV'!$E$6)=\"ON\")*(INDIRECT('2. QT_LV'!$H$6)=C15),0),1),\nINDEX(INDIRECT('2. QT_LV'!$K$6),MATCH(1,(INDIRECT('2. QT_LV'!$F$6)=\"ON\")*(INDIRECT('2. QT_LV'!$H$6)=C15),0),1),\nINDEX(INDIRECT('2. QT_LV'!$K$6),MATCH(1,(INDIRECT('2. QT_LV'!$G$6)=\"ON\")*(INDIRECT('2. QT_LV'!$H$6)=C15),0),1)),\"Chưa vào\")","v":"Chưa vào"},{"$f":"IFERROR(CHOOSE($E$3,\nINDEX(INDIRECT('2. QT_LV'!$L$6),MATCH(1,(INDIRECT('2. QT_LV'!$D$6)=\"ON\")*(INDIRECT('2. QT_LV'!$H$6)=C15),0),1),\nINDEX(INDIRECT('2. QT_LV'!$L$6),MATCH(1,(INDIRECT('2. QT_LV'!$E$6)=\"ON\")*(INDIRECT('2. QT_LV'!$H$6)=C15),0),1),\nINDEX(INDIRECT('2. QT_LV'!$L$6),MATCH(1,(INDIRECT('2. QT_LV'!$F$6)=\"ON\")*(INDIRECT('2. QT_LV'!$H$6)=C15),0),1),\nINDEX(INDIRECT('2. QT_LV'!$L$6),MATCH(1,(INDIRECT('2. QT_LV'!$G$6)=\"ON\")*(INDIRECT('2. QT_LV'!$H$6)=C15),0),1)),\"Chưa vào\")","v":"Chưa vào"},{"$f":"IFERROR(CHOOSE($E$3,\nINDEX(INDIRECT('2. QT_LV'!$M$6),MATCH(1,(INDIRECT('2. QT_LV'!$D$6)=\"ON\")*(INDIRECT('2. QT_LV'!$H$6)=C15),0),1),\nINDEX(INDIRECT('2. QT_LV'!$M$6),MATCH(1,(INDIRECT('2. QT_LV'!$E$6)=\"ON\")*(INDIRECT('2. QT_LV'!$H$6)=C15),0),1),\nINDEX(INDIRECT('2. QT_LV'!$M$6),MATCH(1,(INDIRECT('2. QT_LV'!$F$6)=\"ON\")*(INDIRECT('2. QT_LV'!$H$6)=C15),0),1),\nINDEX(INDIRECT('2. QT_LV'!$M$6),MATCH(1,(INDIRECT('2. QT_LV'!$G$6)=\"ON\")*(INDIRECT('2. QT_LV'!$H$6)=C15),0),1)),\"Chưa vào\")","v":"Chưa vào"},{"$f":"IFERROR(CHOOSE($E$3,\nINDEX(INDIRECT('2. QT_LV'!$N$6),MATCH(1,(INDIRECT('2. QT_LV'!$D$6)=\"ON\")*(INDIRECT('2. QT_LV'!$H$6)=C15),0),1),\nINDEX(INDIRECT('2. QT_LV'!$N$6),MATCH(1,(INDIRECT('2. QT_LV'!$E$6)=\"ON\")*(INDIRECT('2. QT_LV'!$H$6)=C15),0),1),\nINDEX(INDIRECT('2. QT_LV'!$N$6),MATCH(1,(INDIRECT('2. QT_LV'!$F$6)=\"ON\")*(INDIRECT('2. QT_LV'!$H$6)=C15),0),1),\nINDEX(INDIRECT('2. QT_LV'!$N$6),MATCH(1,(INDIRECT('2. QT_LV'!$G$6)=\"ON\")*(INDIRECT('2. QT_LV'!$H$6)=C15),0),1)),\"Chưa vào\")","v":"Chưa vào"},{"$f":"IFERROR(INDEX(DSNV_Import!$D:$D,MATCH('3.TTNV'!$C15,DSNV_Import!$A:$A,0),1),\"\")","v":""},"",{"$f":"IFERROR(INDEX(DSNV_Import!$E:$E,MATCH('3.TTNV'!$C15,DSNV_Import!$A:$A,0),1),\"\")","v":""},{"$f":"IFERROR(INDEX(DSNV_Import!$F:$F,MATCH('3.TTNV'!$C15,DSNV_Import!$A:$A,0),1),\"\")","v":""},{"$f":"IFERROR(INDEX(DSNV_Import!$G:$G,MATCH('3.TTNV'!$C15,DSNV_Import!$A:$A,0),1),\"\")","v":""},{"$f":"IFERROR(INDEX(DSNV_Import!$H:$H,MATCH('3.TTNV'!$C15,DSNV_Import!$A:$A,0),1),\"\")","v":""},{"$f":"IFERROR(INDEX(DSNV_Import!$I:$I,MATCH('3.TTNV'!$C15,DSNV_Import!$A:$A,0),1),\"\")","v":""},{"$f":"IFERROR(INDEX(DSNV_Import!$J:$J,MATCH('3.TTNV'!$C15,DSNV_Import!$A:$A,0),1),\"\")","v":""},{"$f":"IFERROR(\nIF(INDEX(DSNV_Import!$K:$K,MATCH('3.TTNV'!$C15,DSNV_Import!$A:$A,0),1)=0,\"Chưa có TT\",INDEX(DSNV_Import!$K:$K,MATCH('3.TTNV'!$C15,DSNV_Import!$A:$A,0),1)),\"\")","v":""},{"$f":"IFERROR(\nIF(INDEX(DSNV_Import!$L:$L,MATCH('3.TTNV'!$C15,DSNV_Import!$A:$A,0),1)=0,\"Chưa có TT\",INDEX(DSNV_Import!$K:$K,MATCH('3.TTNV'!$C15,DSNV_Import!$A:$A,0),1)),\"\")","v":""},null,null,null,null,null,null,null,null,null,null,null,null,null,null,{"$f":"INDEX(INDIRECT('2. QT_LV'!$O$6),MATCH(1,\n(INDIRECT('2. QT_LV'!$H$6)=C15)*\n(INDIRECT('2. QT_LV'!$T$6)=\"Tăng mới\")*\n(INDIRECT('2. QT_LV'!$B$6)=_xlfn.MAXIFS(INDIRECT('2. QT_LV'!$B$6),INDIRECT('2. QT_LV'!$H$6),C15,INDIRECT('2. QT_LV'!$T$6),\"Tăng mới\")),\n0),1)","v":{"$error":"#N/A"}},{"$error":"#N/A"},{"$f":"('4.Report'!$L$4-AH15)/365","v":{"$error":"#N/A"}},null,null,null,null,null,null,{"$f":"IFERROR(INDEX(INDIRECT('2. QT_LV'!$O$6),MATCH(1,\n(INDIRECT('2. QT_LV'!$H$6)=C15)*\n(INDIRECT('2. QT_LV'!$U$6)=\"Nghỉ việc\")*\n(INDIRECT('2. QT_LV'!$B$6)=_xlfn.MAXIFS(INDIRECT('2. QT_LV'!$B$6),INDIRECT('2. QT_LV'!$H$6),C15,INDIRECT('2. QT_LV'!$U$6),\"Nghỉ việc\"))*\n(INDIRECT('2. QT_LV'!$O$6)>=AH15),0),1),\nDATE(2100,12,31))","v":"2100-12-31"},"31/12/2100",null,null,"0",11000000,0,11000000]
[9,{"$f":"IFERROR(CHOOSE($E$3,\nINDEX(INDIRECT('2. QT_LV'!$C$6),MATCH(1,(INDIRECT('2. QT_LV'!$D$6)=\"ON\")*(INDIRECT('2. QT_LV'!$H$6)=C16),0),1),\nINDEX(INDIRECT('2. QT_LV'!$C$6),MATCH(1,(INDIRECT('2. QT_LV'!$E$6)=\"ON\")*(INDIRECT('2. QT_LV'!$H$6)=C16),0),1),\nINDEX(INDIRECT('2. QT_LV'!$C$6),MATCH(1,(INDIRECT('2. QT_LV'!$F$6)=\"ON\")*(INDIRECT('2. QT_LV'!$H$6)=C16),0),1),\nINDEX(INDIRECT('2. QT_LV'!$C$6),MATCH(1,(INDIRECT('2. QT_LV'!$G$6)=\"ON\")*(INDIRECT('2. QT_LV'!$H$6)=C16),0),1)),\"Chưa vào\")","v":"Chưa vào"},{"$f":"DSNV_Import!A12","v":0},{"$f":"IFERROR(INDEX(DSNV_Import!$B:$B,MATCH('3.TTNV'!$C16,DSNV_Import!$A:$A,0),1),\"\")","v":""},{"$f":"IFERROR(INDEX(DSNV_Import!$C:$C,MATCH('3.TTNV'!$C16,DSNV_Import!$A:$A,0),1),\"\")","v":""},{"$f":"IFERROR(CHOOSE($E$3,\nINDEX(INDIRECT('2. QT_LV'!$K$6),MATCH(1,(INDIRECT('2. QT_LV'!$D$6)=\"ON\")*(INDIRECT('2. QT_LV'!$H$6)=C16),0),1),\nINDEX(INDIRECT('2. QT_LV'!$K$6),MATCH(1,(INDIRECT('2. QT_LV'!$E$6)=\"ON\")*(INDIRECT('2. QT_LV'!$H$6)=C16),0),1),\nINDEX(INDIRECT('2. QT_LV'!$K$6),MATCH(1,(INDIRECT('2. QT_LV'!$F$6)=\"ON\")*(INDIRECT('2. QT_LV'!$H$6)=C16),0),1),\nINDEX(INDIRECT('2. QT_LV'!$K$6),MATCH(1,(INDIRECT('2. QT_LV'!$G$6)=\"ON\")*(INDIRECT('2. QT_LV'!$H$6)=C16),0),1)),\"Chưa vào\")","v":"Chưa vào"},{"$f":"IFERROR(CHOOSE($E$3,\nINDEX(INDIRECT('2. QT_LV'!$L$6),MATCH(1,(INDIRECT('2. QT_LV'!$D$6)=\"ON\")*(INDIRECT('2. QT_LV'!$H$6)=C16),0),1),\nINDEX(INDIRECT('2. QT_LV'!$L$6),MATCH(1,(INDIRECT('2. QT_LV'!$E$6)=\"ON\")*(INDIRECT('2. QT_LV'!$H$6)=C16),0),1),\nINDEX(INDIRECT('2. QT_LV'!$L$6),MATCH(1,(INDIRECT('2. QT_LV'!$F$6)=\"ON\")*(INDIRECT('2. QT_LV'!$H$6)=C16),0),1),\nINDEX(INDIRECT('2. QT_LV'!$L$6),MATCH(1,(INDIRECT('2. QT_LV'!$G$6)=\"ON\")*(INDIRECT('2. QT_LV'!$H$6)=C16),0),1)),\"Chưa vào\")","v":"Chưa vào"},{"$f":"IFERROR(CHOOSE($E$3,\nINDEX(INDIRECT('2. QT_LV'!$M$6),MATCH(1,(INDIRECT('2. QT_LV'!$D$6)=\"ON\")*(INDIRECT('2. QT_LV'!$H$6)=C16),0),1),\nINDEX(INDIRECT('2. QT_LV'!$M$6),MATCH(1,(INDIRECT('2. QT_LV'!$E$6)=\"ON\")*(INDIRECT('2. QT_LV'!$H$6)=C16),0),1),\nINDEX(INDIRECT('2. QT_LV'!$M$6),MATCH(1,(INDIRECT('2. QT_LV'!$F$6)=\"ON\")*(INDIRECT('2. QT_LV'!$H$6)=C16),0),1),\nINDEX(INDIRECT('2. QT_LV'!$M$6),MATCH(1,(INDIRECT('2. QT_LV'!$G$6)=\"ON\")*(INDIRECT('2. QT_LV'!$H$6)=C16),0),1)),\"Chưa vào\")","v":"Chưa vào"},{"$f":"IFERROR(CHOOSE($E$3,\nINDEX(INDIRECT('2. QT_LV'!$N$6),MATCH(1,(INDIRECT('2. QT_LV'!$D$6)=\"ON\")*(INDIRECT('2. QT_LV'!$H$6)=C16),0),1),\nINDEX(INDIRECT('2. QT_LV'!$N$6),MATCH(1,(INDIRECT('2. QT_LV'!$E$6)=\"ON\")*(INDIRECT('2. QT_LV'!$H$6)=C16),0),1),\nINDEX(INDIRECT('2. QT_LV'!$N$6),MATCH(1,(INDIRECT('2. QT_LV'!$F$6)=\"ON\")*(INDIRECT('2. QT_LV'!$H$6)=C16),0),1),\nINDEX(INDIRECT('2. QT_LV'!$N$6),MATCH(1,(INDIRECT('2. QT_LV'!$G$6)=\"ON\")*(INDIRECT('2. QT_LV'!$H$6)=C16),0),1)),\"Chưa vào\")","v":"Chưa vào"},{"$f":"IFERROR(INDEX(DSNV_Import!$D:$D,MATCH('3.TTNV'!$C16,DSNV_Import!$A:$A,0),1),\"\")","v":""},"",{"$f":"IFERROR(INDEX(DSNV_Import!$E:$E,MATCH('3.TTNV'!$C16,DSNV_Import!$A:$A,0),1),\"\")","v":""},{"$f":"IFERROR(INDEX(DSNV_Import!$F:$F,MATCH('3.TTNV'!$C16,DSNV_Import!$A:$A,0),1),\"\")","v":""},{"$f":"IFERROR(INDEX(DSNV_Import!$G:$G,MATCH('3.TTNV'!$C16,DSNV_Import!$A:$A,0),1),\"\")","v":""},{"$f":"IFERROR(INDEX(DSNV_Import!$H:$H,MATCH('3.TTNV'!$C16,DSNV_Import!$A:$A,0),1),\"\")","v":""},{"$f":"IFERROR(INDEX(DSNV_Import!$I:$I,MATCH('3.TTNV'!$C16,DSNV_Import!$A:$A,0),1),\"\")","v":""},{"$f":"IFERROR(INDEX(DSNV_Import!$J:$J,MATCH('3.TTNV'!$C16,DSNV_Import!$A:$A,0),1),\"\")","v":""},{"$f":"IFERROR(\nIF(INDEX(DSNV_Import!$K:$K,MATCH('3.TTNV'!$C16,DSNV_Import!$A:$A,0),1)=0,\"Chưa có TT\",INDEX(DSNV_Import!$K:$K,MATCH('3.TTNV'!$C16,DSNV_Import!$A:$A,0),1)),\"\")","v":""},{"$f":"IFERROR(\nIF(INDEX(DSNV_Import!$L:$L,MATCH('3.TTNV'!$C16,DSNV_Import!$A:$A,0),1)=0,\"Chưa có TT\",INDEX(DSNV_Import!$K:$K,MATCH('3.TTNV'!$C16,DSNV_Import!$A:$A,0),1)),\"\")","v":""},null,null,null,null,null,null,null,null,null,null,null,null,null,null,{"$f":"INDEX(INDIRECT('2. QT_LV'!$O$6),MATCH(1,\n(INDIRECT('2. QT_LV'!$H$6)=C16)*\n(INDIRECT('2. QT_LV'!$T$6)=\"Tăng mới\")*\n(INDIRECT('2. QT_LV'!$B$6)=_xlfn.MAXIFS(INDIRECT('2. QT_LV'!$B$6),INDIRECT('2. QT_LV'!$H$6),C16,INDIRECT('2. QT_LV'!$T$6),\"Tăng mới\")),\n0),1)","v":{"$error":"#N/A"}},{"$error":"#N/A"},{"$f":"('4.Report'!$L$4-AH16)/365","v":{"$error":"#N/A"}},null,null,null,null,null,null,{"$f":"IFERROR(INDEX(INDIRECT('2. QT_LV'!$O$6),MATCH(1,\n(INDIRECT('2. QT_LV'!$H$6)=C16)*\n(INDIRECT('2. QT_LV'!$U$6)=\"Nghỉ việc\")*\n(INDIRECT('2. QT_LV'!$B$6)=_xlfn.MAXIFS(INDIRECT('2. QT_LV'!$B$6),INDIRECT('2. QT_LV'!$H$6),C16,INDIRECT('2. QT_LV'!$U$6),\"Nghỉ việc\"))*\n(INDIRECT('2. QT_LV'!$O$6)>=AH16),0),1),\nDATE(2100,12,31))","v":"2100-12-31"},"31/12/2100",null,null,"0",11000000,0,11000000]
[10,{"$f":"IFERROR(CHOOSE($E$3,\nINDEX(INDIRECT('2. QT_LV'!$C$6),MATCH(1,(INDIRECT('2. QT_LV'!$D$6)=\"ON\")*(INDIRECT('2. QT_LV'!$H$6)=C17),0),1),\nINDEX(INDIRECT('2. QT_LV'!$C$6),MATCH(1,(INDIRECT('2. QT_LV'!$E$6)=\"ON\")*(INDIRECT('2. QT_LV'!$H$6)=C17),0),1),\nINDEX(INDIRECT('2. QT_LV'!$C$6),MATCH(1,(INDIRECT('2. QT_LV'!$F$6)=\"ON\")*(INDIRECT('2. QT_LV'!$H$6)=C17),0),1),\nINDEX(INDIRECT('2. QT_LV'!$C$6),MATCH(1,(INDIRECT('2. QT_LV'!$G$6)=\"ON\")*(INDIRECT('2. QT_LV'!$H$6)=C17),0),1)),\"Chưa vào\")","v":"Chưa vào"},{"$f":"DSNV_Import!A13","v":0},{"$f":"IFERROR(INDEX(DSNV_Import!$B:$B,MATCH('3.TTNV'!$C17,DSNV_Import!$A:$A,0),1),\"\")","v":""},{"$f":"IFERROR(INDEX(DSNV_Import!$C:$C,MATCH('3.TTNV'!$C17,DSNV_Import!$A:$A,0),1),\"\")","v":""},{"$f":"IFERROR(CHOOSE($E$3,\nINDEX(INDIRECT('2. QT_LV'!$K$6),MATCH(1,(INDIRECT('2. QT_LV'!$D$6)=\"ON\")*(INDIRECT('2. QT_LV'!$H$6)=C17),0),1),\nINDEX(INDIRECT('2. QT_LV'!$K$6),MATCH(1,(INDIRECT('2. QT_LV'!$E$6)=\"ON\")*(INDIRECT('2. QT_LV'!$H$6)=C17),0),1),\nINDEX(INDIRECT('2. QT_LV'!$K$6),MATCH(1,(INDIRECT('2. QT_LV'!$F$6)=\"ON\")*(INDIRECT('2. QT_LV'!$H$6)=C17),0),1),\nINDEX(INDIRECT('2. QT_LV'!$K$6),MATCH(1,(INDIRECT('2. QT_LV'!$G$6)=\"ON\")*(INDIRECT('2. QT_LV'!$H$6)=C17),0),1)),\"Chưa vào\")","v":"Chưa vào"},{"$f":"IFERROR(CHOOSE($E$3,\nINDEX(INDIRECT('2. QT_LV'!$L$6),MATCH(1,(INDIRECT('2. QT_LV'!$D$6)=\"ON\")*(INDIRECT('2. QT_LV'!$H$6)=C17),0),1),\nINDEX(INDIRECT('2. QT_LV'!$L$6),MATCH(1,(INDIRECT('2. QT_LV'!$E$6)=\"ON\")*(INDIRECT('2. QT_LV'!$H$6)=C17),0),1),\nINDEX(INDIRECT('2. QT_LV'!$L$6),MATCH(1,(INDIRECT('2. QT_LV'!$F$6)=\"ON\")*(INDIRECT('2. QT_LV'!$H$6)=C17),0),1),\nINDEX(INDIRECT('2. QT_LV'!$L$6),MATCH(1,(INDIRECT('2. QT_LV'!$G$6)=\"ON\")*(INDIRECT('2. QT_LV'!$H$6)=C17),0),1)),\"Chưa vào\")","v":"Chưa vào"},{"$f":"IFERROR(CHOOSE($E$3,\nINDEX(INDIRECT('2. QT_LV'!$M$6),MATCH(1,(INDIRECT('2. QT_LV'!$D$6)=\"ON\")*(INDIRECT('2. QT_LV'!$H$6)=C17),0),1),\nINDEX(INDIRECT('2. QT_LV'!$M$6),MATCH(1,(INDIRECT('2. QT_LV'!$E$6)=\"ON\")*(INDIRECT('2. QT_LV'!$H$6)=C17),0),1),\nINDEX(INDIRECT('2. QT_LV'!$M$6),MATCH(1,(INDIRECT('2. QT_LV'!$F$6)=\"ON\")*(INDIRECT('2. QT_LV'!$H$6)=C17),0),1),\nINDEX(INDIRECT('2. QT_LV'!$M$6),MATCH(1,(INDIRECT('2. QT_LV'!$G$6)=\"ON\")*(INDIRECT('2. QT_LV'!$H$6)=C17),0),1)),\"Chưa vào\")","v":"Chưa vào"},{"$f":"IFERROR(CHOOSE($E$3,\nINDEX(INDIRECT('2. QT_LV'!$N$6),MATCH(1,(INDIRECT('2. QT_LV'!$D$6)=\"ON\")*(INDIRECT('2. QT_LV'!$H$6)=C17),0),1),\nINDEX(INDIRECT('2. QT_LV'!$N$6),MATCH(1,(INDIRECT('2. QT_LV'!$E$6)=\"ON\")*(INDIRECT('2. QT_LV'!$H$6)=C17),0),1),\nINDEX(INDIRECT('2. QT_LV'!$N$6),MATCH(1,(INDIRECT('2. QT_LV'!$F$6)=\"ON\")*(INDIRECT('2. QT_LV'!$H$6)=C17),0),1),\nINDEX(INDIRECT('2. QT_LV'!$N$6),MATCH(1,(INDIRECT('2. QT_LV'!$G$6)=\"ON\")*(INDIRECT('2. QT_LV'!$H$6)=C17),0),1)),\"Chưa vào\")","v":"Chưa vào"},{"$f":"IFERROR(INDEX(DSNV_Import!$D:$D,MATCH('3.TTNV'!$C17,DSNV_Import!$A:$A,0),1),\"\")","v":""},"",{"$f":"IFERROR(INDEX(DSNV_Import!$E:$E,MATCH('3.TTNV'!$C17,DSNV_Import!$A:$A,0),1),\"\")","v":""},{"$f":"IFERROR(INDEX(DSNV_Import!$F:$F,MATCH('3.TTNV'!$C17,DSNV_Import!$A:$A,0),1),\"\")","v":""},{"$f":"IFERROR(INDEX(DSNV_Import!$G:$G,MATCH('3.TTNV'!$C17,DSNV_Import!$A:$A,0),1),\"\")","v":""},{"$f":"IFERROR(INDEX(DSNV_Import!$H:$H,MATCH('3.TTNV'!$C17,DSNV_Import!$A:$A,0),1),\"\")","v":""},{"$f":"IFERROR(INDEX(DSNV_Import!$I:$I,MATCH('3.TTNV'!$C17,DSNV_Import!$A:$A,0),1),\"\")","v":""},{"$f":"IFERROR(INDEX(DSNV_Import!$J:$J,MATCH('3.TTNV'!$C17,DSNV_Import!$A:$A,0),1),\"\")","v":""},{"$f":"IFERROR(\nIF(INDEX(DSNV_Import!$K:$K,MATCH('3.TTNV'!$C17,DSNV_Import!$A:$A,0),1)=0,\"Chưa có TT\",INDEX(DSNV_Import!$K:$K,MATCH('3.TTNV'!$C17,DSNV_Import!$A:$A,0),1)),\"\")","v":""},{"$f":"IFERROR(\nIF(INDEX(DSNV_Import!$L:$L,MATCH('3.TTNV'!$C17,DSNV_Import!$A:$A,0),1)=0,\"Chưa có TT\",INDEX(DSNV_Import!$K:$K,MATCH('3.TTNV'!$C17,DSNV_Import!$A:$A,0),1)),\"\")","v":""},null,null,null,null,null,null,null,null,null,null,null,null,null,null,{"$f":"INDEX(INDIRECT('2. QT_LV'!$O$6),MATCH(1,\n(INDIRECT('2. QT_LV'!$H$6)=C17)*\n(INDIRECT('2. QT_LV'!$T$6)=\"Tăng mới\")*\n(INDIRECT('2. QT_LV'!$B$6)=_xlfn.MAXIFS(INDIRECT('2. QT_LV'!$B$6),INDIRECT('2. QT_LV'!$H$6),C17,INDIRECT('2. QT_LV'!$T$6),\"Tăng mới\")),\n0),1)","v":{"$error":"#N/A"}},{"$error":"#N/A"},{"$f":"('4.Report'!$L$4-AH17)/365","v":{"$error":"#N/A"}},null,null,null,null,null,null,{"$f":"IFERROR(INDEX(INDIRECT('2. QT_LV'!$O$6),MATCH(1,\n(INDIRECT('2. QT_LV'!$H$6)=C17)*\n(INDIRECT('2. QT_LV'!$U$6)=\"Nghỉ việc\")*\n(INDIRECT('2. QT_LV'!$B$6)=_xlfn.MAXIFS(INDIRECT('2. QT_LV'!$B$6),INDIRECT('2. QT_LV'!$H$6),C17,INDIRECT('2. QT_LV'!$U$6),\"Nghỉ việc\"))*\n(INDIRECT('2. QT_LV'!$O$6)>=AH17),0),1),\nDATE(2100,12,31))","v":"2100-12-31"},"31/12/2100",null,null,"0",11000000,0,11000000]
[11,{"$f":"IFERROR(CHOOSE($E$3,\nINDEX(INDIRECT('2. QT_LV'!$C$6),MATCH(1,(INDIRECT('2. QT_LV'!$D$6)=\"ON\")*(INDIRECT('2. QT_LV'!$H$6)=C18),0),1),\nINDEX(INDIRECT('2. QT_LV'!$C$6),MATCH(1,(INDIRECT('2. QT_LV'!$E$6)=\"ON\")*(INDIRECT('2. QT_LV'!$H$6)=C18),0),1),\nINDEX(INDIRECT('2. QT_LV'!$C$6),MATCH(1,(INDIRECT('2. QT_LV'!$F$6)=\"ON\")*(INDIRECT('2. QT_LV'!$H$6)=C18),0),1),\nINDEX(INDIRECT('2. QT_LV'!$C$6),MATCH(1,(INDIRECT('2. QT_LV'!$G$6)=\"ON\")*(INDIRECT('2. QT_LV'!$H$6)=C18),0),1)),\"Chưa vào\")","v":"Chưa vào"},{"$f":"DSNV_Import!A14","v":0},{"$f":"IFERROR(INDEX(DSNV_Import!$B:$B,MATCH('3.TTNV'!$C18,DSNV_Import!$A:$A,0),1),\"\")","v":""},{"$f":"IFERROR(INDEX(DSNV_Import!$C:$C,MATCH('3.TTNV'!$C18,DSNV_Import!$A:$A,0),1),\"\")","v":""},{"$f":"IFERROR(CHOOSE($E$3,\nINDEX(INDIRECT('2. QT_LV'!$K$6),MATCH(1,(INDIRECT('2. QT_LV'!$D$6)=\"ON\")*(INDIRECT('2. QT_LV'!$H$6)=C18),0),1),\nINDEX(INDIRECT('2. QT_LV'!$K$6),MATCH(1,(INDIRECT('2. QT_LV'!$E$6)=\"ON\")*(INDIRECT('2. QT_LV'!$H$6)=C18),0),1),\nINDEX(INDIRECT('2. QT_LV'!$K$6),MATCH(1,(INDIRECT('2. QT_LV'!$F$6)=\"ON\")*(INDIRECT('2. QT_LV'!$H$6)=C18),0),1),\nINDEX(INDIRECT('2. QT_LV'!$K$6),MATCH(1,(INDIRECT('2. QT_LV'!$G$6)=\"ON\")*(INDIRECT('2. QT_LV'!$H$6)=C18),0),1)),\"Chưa vào\")","v":"Chưa vào"},{"$f":"IFERROR(CHOOSE($E$3,\nINDEX(INDIRECT('2. QT_LV'!$L$6),MATCH(1,(INDIRECT('2. QT_LV'!$D$6)=\"ON\")*(INDIRECT('2. QT_LV'!$H$6)=C18),0),1),\nINDEX(INDIRECT('2. QT_LV'!$L$6),MATCH(1,(INDIRECT('2. QT_LV'!$E$6)=\"ON\")*(INDIRECT('2. QT_LV'!$H$6)=C18),0),1),\nINDEX(INDIRECT('2. QT_LV'!$L$6),MATCH(1,(INDIRECT('2. QT_LV'!$F$6)=\"ON\")*(INDIRECT('2. QT_LV'!$H$6)=C18),0),1),\nINDEX(INDIRECT('2. QT_LV'!$L$6),MATCH(1,(INDIRECT('2. QT_LV'!$G$6)=\"ON\")*(INDIRECT('2. QT_LV'!$H$6)=C18),0),1)),\"Chưa vào\")","v":"Chưa vào"},{"$f":"IFERROR(CHOOSE($E$3,\nINDEX(INDIRECT('2. QT_LV'!$M$6),MATCH(1,(INDIRECT('2. QT_LV'!$D$6)=\"ON\")*(INDIRECT('2. QT_LV'!$H$6)=C18),0),1),\nINDEX(INDIRECT('2. QT_LV'!$M$6),MATCH(1,(INDIRECT('2. QT_LV'!$E$6)=\"ON\")*(INDIRECT('2. QT_LV'!$H$6)=C18),0),1),\nINDEX(INDIRECT('2. QT_LV'!$M$6),MATCH(1,(INDIRECT('2. QT_LV'!$F$6)=\"ON\")*(INDIRECT('2. QT_LV'!$H$6)=C18),0),1),\nINDEX(INDIRECT('2. QT_LV'!$M$6),MATCH(1,(INDIRECT('2. QT_LV'!$G$6)=\"ON\")*(INDIRECT('2. QT_LV'!$H$6)=C18),0),1)),\"Chưa vào\")","v":"Chưa vào"},{"$f":"IFERROR(CHOOSE($E$3,\nINDEX(INDIRECT('2. QT_LV'!$N$6),MATCH(1,(INDIRECT('2. QT_LV'!$D$6)=\"ON\")*(INDIRECT('2. QT_LV'!$H$6)=C18),0),1),\nINDEX(INDIRECT('2. QT_LV'!$N$6),MATCH(1,(INDIRECT('2. QT_LV'!$E$6)=\"ON\")*(INDIRECT('2. QT_LV'!$H$6)=C18),0),1),\nINDEX(INDIRECT('2. QT_LV'!$N$6),MATCH(1,(INDIRECT('2. QT_LV'!$F$6)=\"ON\")*(INDIRECT('2. QT_LV'!$H$6)=C18),0),1),\nINDEX(INDIRECT('2. QT_LV'!$N$6),MATCH(1,(INDIRECT('2. QT_LV'!$G$6)=\"ON\")*(INDIRECT('2. QT_LV'!$H$6)=C18),0),1)),\"Chưa vào\")","v":"Chưa vào"},{"$f":"IFERROR(INDEX(DSNV_Import!$D:$D,MATCH('3.TTNV'!$C18,DSNV_Import!$A:$A,0),1),\"\")","v":""},"",{"$f":"IFERROR(INDEX(DSNV_Import!$E:$E,MATCH('3.TTNV'!$C18,DSNV_Import!$A:$A,0),1),\"\")","v":""},{"$f":"IFERROR(INDEX(DSNV_Import!$F:$F,MATCH('3.TTNV'!$C18,DSNV_Import!$A:$A,0),1),\"\")","v":""},{"$f":"IFERROR(INDEX(DSNV_Import!$G:$G,MATCH('3.TTNV'!$C18,DSNV_Import!$A:$A,0),1),\"\")","v":""},{"$f":"IFERROR(INDEX(DSNV_Import!$H:$H,MATCH('3.TTNV'!$C18,DSNV_Import!$A:$A,0),1),\"\")","v":""},{"$f":"IFERROR(INDEX(DSNV_Import!$I:$I,MATCH('3.TTNV'!$C18,DSNV_Import!$A:$A,0),1),\"\")","v":""},{"$f":"IFERROR(INDEX(DSNV_Import!$J:$J,MATCH('3.TTNV'!$C18,DSNV_Import!$A:$A,0),1),\"\")","v":""},{"$f":"IFERROR(\nIF(INDEX(DSNV_Import!$K:$K,MATCH('3.TTNV'!$C18,DSNV_Import!$A:$A,0),1)=0,\"Chưa có TT\",INDEX(DSNV_Import!$K:$K,MATCH('3.TTNV'!$C18,DSNV_Import!$A:$A,0),1)),\"\")","v":""},{"$f":"IFERROR(\nIF(INDEX(DSNV_Import!$L:$L,MATCH('3.TTNV'!$C18,DSNV_Import!$A:$A,0),1)=0,\"Chưa có TT\",INDEX(DSNV_Import!$K:$K,MATCH('3.TTNV'!$C18,DSNV_Import!$A:$A,0),1)),\"\")","v":""},null,null,null,null,null,null,null,null,null,null,null,null,null,null,{"$f":"INDEX(INDIRECT('2. QT_LV'!$O$6),MATCH(1,\n(INDIRECT('2. QT_LV'!$H$6)=C18)*\n(INDIRECT('2. QT_LV'!$T$6)=\"Tăng mới\")*\n(INDIRECT('2. QT_LV'!$B$6)=_xlfn.MAXIFS(INDIRECT('2. QT_LV'!$B$6),INDIRECT('2. QT_LV'!$H$6),C18,INDIRECT('2. QT_LV'!$T$6),\"Tăng mới\")),\n0),1)","v":{"$error":"#N/A"}},{"$error":"#N/A"},{"$f":"('4.Report'!$L$4-AH18)/365","v":{"$error":"#N/A"}},null,null,null,null,null,null,{"$f":"IFERROR(INDEX(INDIRECT('2. QT_LV'!$O$6),MATCH(1,\n(INDIRECT('2. QT_LV'!$H$6)=C18)*\n(INDIRECT('2. QT_LV'!$U$6)=\"Nghỉ việc\")*\n(INDIRECT('2. QT_LV'!$B$6)=_xlfn.MAXIFS(INDIRECT('2. QT_LV'!$B$6),INDIRECT('2. QT_LV'!$H$6),C18,INDIRECT('2. QT_LV'!$U$6),\"Nghỉ việc\"))*\n(INDIRECT('2. QT_LV'!$O$6)>=AH18),0),1),\nDATE(2100,12,31))","v":"2100-12-31"},"31/12/2100",null,null,"0",11000000,0,11000000]

{"sheet":"2. QT_LV","index":6,"n_rows":12,"n_cols":33,"rows_kept":12,"cut":false,"hidden":false,"merged":[[2,1,2,2],[2,5,2,7]]}
["THEO DÕI QUÁ TRÌNH LÀM VIỆC"]
[]
[null,"Check tổng",null,{"$f":"IF(AND(AC4=0,AD4=0,AE4=0,AF4=0),\"OK\",\"Lỗi\")","v":"Lỗi"},null,"Kỳ theo dõi: Từ ngày",null,null,{"$f":"'4.Report'!H4","v":"2019-07-01"},"Đến ngày",{"$f":"'4.Report'!L4","v":"2019-07-31"},null,null,null,null,null,null,null,null,null,null,null,null,null,null,null,null,null,"Nếu bằng 0 là OK","Nếu bằng 0 là OK","Nếu không có \"Nhập sai\" là OK","Nếu không có \"Nhập sai\" là OK"]
[null,null,null,null,null,null,null,null,null,null,null,null,null,null,null,null,null,null,null,null,null,null,null,null,null,null,null,null,{"$f":"COUNTIF(INDIRECT(AC6),\"False\")","v":4},{"$f":"COUNTIF(INDIRECT(AD6),\"False\")","v":0},0,0]
["CT","CT","Chọn","CT","CT","CT","CT","Điền","CT","CT","Điền","Điền","Điền","Điền","Điền","Điền","CT","CT","CT","Chọn","Chọn","CT","CT","CT","CT","CT","CT","CT","CT","CT","CT","CT","Điền"]
[{"$f":"ADDRESS(ROW($A$8),1,1,1,\"2. QT_LV\") & \":\" & ADDRESS(MAX('2. QT_LV'!A8:A999701)+6,1,1,1)","v":"'2. QT_LV'!$A$8:$A$11"},{"$f":"SUBSTITUTE($A$6,\"$A$\",\"$\"&LEFT(ADDRESS(1,COLUMN(),4,1),LEN(ADDRESS(1,COLUMN(),4,1))-1)&\"$\")","v":"'2. QT_LV'!$B$8:$B$11"},"'2. QT_LV'!$C$8:$C$11","'2. QT_LV'!$D$8:$D$11","'2. QT_LV'!$E$8:$E$11","'2. QT_LV'!$F$8:$F$11","'2. QT_LV'!$G$8:$G$11","'2. QT_LV'!$H$8:$H$11","'2. QT_LV'!$I$8:$I$11","'2. QT_LV'!$J$8:$J$11","'2. QT_LV'!$K$8:$K$11","'2. QT_LV'!$L$8:$L$11","'2. QT_LV'!$M$8:$M$11","'2. QT_LV'!$N$8:$N$11","'2. QT_LV'!$O$8:$O$11","'2. QT_LV'!$P$8:$P$11","'2. QT_LV'!$Q$8:$Q$11","'2. QT_LV'!$R$8:$R$11","'2. QT_LV'!$S$8:$S$11","'2. QT_LV'!$T$8:$T$11","'2. QT_LV'!$U$8:$U$11","'2. QT_LV'!$V$8:$V$11","'2. QT_LV'!$W$8:$W$11","'2. QT_LV'!$X$8:$X$11","'2. QT_LV'!$Y$8:$Y$11","'2. QT_LV'!$Z$8:$Z$11","'2. QT_LV'!$AA$8:$AA$11","'2. QT_LV'!$AB$8:$AB$11","'2. QT_LV'!$AC$8:$AC$11","'2. QT_LV'!$AD$8:$AD$11","'2. QT_LV'!$AE$8:$AE$11","'2. QT_LV'!$AF$8:$AF$11","'2. QT_LV'!$AG$8:$AG$11"]
["STT","Quá trình thứ","Trạng thái làm việc","TT ngày đầu kỳ","TT ngày cuối kỳ","TT ngày hiện tại","TT cả quá trình","Mã nhân viên","Họ và tên","Mã đơn vị","Phòng","Bộ phận","Nhóm","Chức danh","Từ ngày","Đến ngày","Từ ngày (TEXT)","Đến ngày (TEXT)","Ảnh hưởng tới SL nhân sự đang làm việc","Lý do TĂNG","Lý do GIẢM","Từ ngày + Lý do tăng","Có phải quá trình này là QT tăng mới nhân sự vào ngày đầu tháng hay không","Có phải QT này kết thúc thì QT tiếp theo sang 1 ĐV hoặc CD mới TRONG THÁNG ko?","Tổng thời gian cả quá trình","Giới tính","Trình độ","Tình trạng hôn nhân","Check - \"Từ ngày\" có nằm sau \"đến ngày\" không","Check - QT có liền mạch không, có bị trùng nhau không","Check - Có nhập đúng đơn vị khi vào công ty hay không","Check - Có nhập đúng đơn vị trước khi nghỉ việc không","Ghi chú"]
[{"$f":"ROW()-ROW($A$7)","v":1},{"$f":"COUNTIFS(INDIRECT($H$6),H8,INDIRECT($O$6),\"<=\"&O8)","v":0},null,{"$f":"IF(AND(($I$3)>=O8,($I$3)<=P8)=TRUE,\"ON\",\"OFF\")","v":"OFF"},{"$f":"IF(AND($K$3>=O8,$K$3<=P8)=TRUE,\"ON\",\"OFF\")","v":"OFF"},"OFF",{"$f":"IF(AND($I$3<$K$3,O8<P8)=TRUE,\nIF(OR($K$3<O8,P8<$I$3)=TRUE,\"OFF\",\"ON\"),\"lỗi\")","v":"lỗi"},null,{"$f":"INDEX('3.TTNV'!$D:$D,MATCH('2. QT_LV'!H8,'3.TTNV'!$C:$C,0),1)","v":""},"02. Phòng Hành chính - Nhân sự00",null,null,null,null,null,null,{"$f":"TEXT(DAY(O8),\"00\")&\"/\"&TEXT(MONTH(O8),\"00\")&\"/\"&YEAR(O8)","v":"00/01/1900"},{"$f":"TEXT(DAY(P8),\"00\")&\"/\"&TEXT(MONTH(P8),\"00\")&\"/\"&YEAR(P8)","v":"00/01/1900"},{"$f":"IFERROR(VLOOKUP(T8,Define!$B$18:$C$22,2,0),\"\")&\nIFERROR(VLOOKUP(U8,Define!$D$18:$E$22,2,0),\"\")","v":""},null,null,{"$f":"O8&T8","v":""},{"$f":"IF(AND(T8=\"Tăng mới\",O8=$I$3),\"Có\",\"Không\")","v":"Không"},{"$f":"IF(AND(OR(\nIFERROR(INDEX(INDIRECT($T$6),MATCH(1,(INDIRECT($H$6)=H8)*(INDIRECT($B$6)=B8+1),0),1),\"\")=\"Thay đổi đơn vị\",\nIFERROR(INDEX(INDIRECT($T$6),MATCH(1,(INDIRECT($H$6)=H8)*(INDIRECT($B$6)=B8+1),0),1),\"\")=\"Thay đổi chức danh\"),\n\nIFERROR(INDEX(INDIRECT($O$6),MATCH(1,(INDIRECT($H$6)=H8)*(INDIRECT($B$6)=B8+1),0),1),\"\")<=$K$3),\n\"Có\",\"Không\")","v":"Không"},{"$f":"P8-O8+1","v":1},{"$f":"INDEX('3.TTNV'!E:E,MATCH(H8,'3.TTNV'!C:C,0),1)","v":""},{"$f":"INDEX('3.TTNV'!AE:AE,MATCH(H8,'3.TTNV'!C:C,0),1)","v":0},{"$f":"INDEX('3.TTNV'!Q:Q,MATCH(I8,'3.TTNV'!D:D,0),1)","v":""},{"$f":"P8>O8","v":false},{"$f":"(_xlfn.MAXIFS(INDIRECT($P$6),INDIRECT($H$6),H8)-_xlfn.MINIFS(INDIRECT($O$6),INDIRECT($H$6),H8)+1)-SUMIFS(INDIRECT($Y$6),INDIRECT($H$6),H8)","v":1},{"$f":"IF(AND(\nINDEX(INDIRECT($H$6),MATCH(J8,INDIRECT($D$6),0),1)<=O8=TRUE,\nINDEX(INDIRECT($I$6),MATCH(J8,INDIRECT($D$6),0),1)>=O8=TRUE),\"Nhập đúng\",\"Nhập sai\")","v":{"$error":"#N/A"}},{"$f":"IF(C8=\"Đã nghỉ việc\",\nIF(INDEX(INDIRECT($J$6),MATCH(1,(INDIRECT($B$6)=B8-1)*(INDIRECT($H$6)=H8),0),1)=J8,\"Nhập đúng\",\"Nhập sai\"),\"\")","v":""}]
[2,0,null,"OFF","OFF",{"$f":"#N/A","v":{"$error":"#N/A"}},"lỗi",null,{"$f":"INDEX('3.TTNV'!$D:$D,MATCH('2. QT_LV'!H9,'3.TTNV'!$C:$C,0),1)","v":""},{"$f":"#N/A","v":"05. Phòng Marketing0Nhóm Kênh"},null,null,null,null,null,null,"00/01/1900","00/01/1900",{"$f":"IFERROR(VLOOKUP(T9,Define!$B$18:$C$22,2,0),\"\")&\nIFERROR(VLOOKUP(U9,Define!$D$18:$E$22,2,0),\"\")","v":""},null,null,"","Không",{"$f":"IF(AND(OR(\nIFERROR(INDEX(INDIRECT($T$6),MATCH(1,(INDIRECT($H$6)=H9)*(INDIRECT($B$6)=B9+1),0),1),\"\")=\"Thay đổi đơn vị\",\nIFERROR(INDEX(INDIRECT($T$6),MATCH(1,(INDIRECT($H$6)=H9)*(INDIRECT($B$6)=B9+1),0),1),\"\")=\"Thay đổi chức danh\"),\n\nIFERROR(INDEX(INDIRECT($O$6),MATCH(1,(INDIRECT($H$6)=H9)*(INDIRECT($B$6)=B9+1),0),1),\"\")<=$K$3),\n\"Có\",\"Không\")","v":"Không"},1,{"$f":"INDEX('3.TTNV'!E:E,MATCH(H9,'3.TTNV'!C:C,0),1)","v":""},{"$f":"INDEX('3.TTNV'!AE:AE,MATCH(H9,'3.TTNV'!C:C,0),1)","v":0},{"$f":"INDEX('3.TTNV'!Q:Q,MATCH(I9,'3.TTNV'!D:D,0),1)","v":""},false,1,{"$f":"IF(AND(\nINDEX('1. QT_ĐV'!$G:$G,MATCH(J9,'1. QT_ĐV'!$C:$C,0),1)<=O9=TRUE,\nINDEX('1. QT_ĐV'!$H:$H,MATCH(J9,'1. QT_ĐV'!$C:$C,0),1)>=O9=TRUE),\"Nhập đúng\",\"Nhập sai\")","v":{"$error":"#N/A"}},{"$f":"IF(C9=\"Đã nghỉ việc\",\nIF(INDEX(INDIRECT($J$6),MATCH(1,(INDIRECT($B$6)=B9-1)*(INDIRECT($H$6)=H9),0),1)=J9,\"Nhập đúng\",\"Nhập sai\"),\"\")","v":""}]
[3,0,null,"OFF","OFF",{"$f":"#N/A","v":{"$error":"#N/A"}},"lỗi",null,{"$f":"INDEX('3.TTNV'!$D:$D,MATCH('2. QT_LV'!H10,'3.TTNV'!$C:$C,0),1)","v":""},{"$f":"#N/A","v":"05. Phòng Marketing0Nhóm Kênh"},null,null,null,null,null,null,"00/01/1900","00/01/1900",{"$f":"IFERROR(VLOOKUP(T10,Define!$B$18:$C$22,2,0),\"\")&\nIFERROR(VLOOKUP(U10,Define!$D$18:$E$22,2,0),\"\")","v":""},null,null,"","Không",{"$f":"IF(AND(OR(\nIFERROR(INDEX(INDIRECT($T$6),MATCH(1,(INDIRECT($H$6)=H10)*(INDIRECT($B$6)=B10+1),0),1),\"\")=\"Thay đổi đơn vị\",\nIFERROR(INDEX(INDIRECT($T$6),MATCH(1,(INDIRECT($H$6)=H10)*(INDIRECT($B$6)=B10+1),0),1),\"\")=\"Thay đổi chức danh\"),\n\nIFERROR(INDEX(INDIRECT($O$6),MATCH(1,(INDIRECT($H$6)=H10)*(INDIRECT($B$6)=B10+1),0),1),\"\")<=$K$3),\n\"Có\",\"Không\")","v":"Không"},1,{"$f":"INDEX('3.TTNV'!E:E,MATCH(H10,'3.TTNV'!C:C,0),1)","v":""},{"$f":"INDEX('3.TTNV'!AE:AE,MATCH(H10,'3.TTNV'!C:C,0),1)","v":0},{"$f":"INDEX('3.TTNV'!Q:Q,MATCH(I10,'3.TTNV'!D:D,0),1)","v":""},false,1,{"$f":"IF(AND(\nINDEX('1. QT_ĐV'!$G:$G,MATCH(J10,'1. QT_ĐV'!$C:$C,0),1)<=O10=TRUE,\nINDEX('1. QT_ĐV'!$H:$H,MATCH(J10,'1. QT_ĐV'!$C:$C,0),1)>=O10=TRUE),\"Nhập đúng\",\"Nhập sai\")","v":{"$error":"#N/A"}},{"$f":"IF(C10=\"Đã nghỉ việc\",\nIF(INDEX(INDIRECT($J$6),MATCH(1,(INDIRECT($B$6)=B10-1)*(INDIRECT($H$6)=H10),0),1)=J10,\"Nhập đúng\",\"Nhập sai\"),\"\")","v":""}]
[4,0,null,"OFF","OFF",{"$f":"#N/A","v":{"$error":"#N/A"}},"lỗi",null,{"$f":"INDEX('3.TTNV'!$D:$D,MATCH('2. QT_LV'!H11,'3.TTNV'!$C:$C,0),1)","v":""},{"$f":"#N/A","v":"02. Phòng Hành chính - Nhân sự00"},null,null,null,null,null,null,"00/01/1900","00/01/1900",{"$f":"IFERROR(VLOOKUP(T11,Define!$B$18:$C$22,2,0),\"\")&\nIFERROR(VLOOKUP(U11,Define!$D$18:$E$22,2,0),\"\")","v":""},null,null,"","Không",{"$f":"IF(AND(OR(\nIFERROR(INDEX(INDIRECT($T$6),MATCH(1,(INDIRECT($H$6)=H11)*(INDIRECT($B$6)=B11+1),0),1),\"\")=\"Thay đổi đơn vị\",\nIFERROR(INDEX(INDIRECT($T$6),MATCH(1,(INDIRECT($H$6)=H11)*(INDIRECT($B$6)=B11+1),0),1),\"\")=\"Thay đổi chức danh\"),\n\nIFERROR(INDEX(INDIRECT($O$6),MATCH(1,(INDIRECT($H$6)=H11)*(INDIRECT($B$6)=B11+1),0),1),\"\")<=$K$3),\n\"Có\",\"Không\")","v":"Không"},1,{"$f":"INDEX('3.TTNV'!E:E,MATCH(H11,'3.TTNV'!C:C,0),1)","v":""},{"$f":"INDEX('3.TTNV'!AE:AE,MATCH(H11,'3.TTNV'!C:C,0),1)","v":0},{"$f":"INDEX('3.TTNV'!Q:Q,MATCH(I11,'3.TTNV'!D:D,0),1)","v":""},false,1,{"$f":"IF(AND(\nINDEX('1. QT_ĐV'!$G:$G,MATCH(J11,'1. QT_ĐV'!$C:$C,0),1)<=O11=TRUE,\nINDEX('1. QT_ĐV'!$H:$H,MATCH(J11,'1. QT_ĐV'!$C:$C,0),1)>=O11=TRUE),\"Nhập đúng\",\"Nhập sai\")","v":"Nhập sai"},{"$f":"IF(C11=\"Đã nghỉ việc\",\nIF(INDEX(INDIRECT($J$6),MATCH(1,(INDIRECT($B$6)=B11-1)*(INDIRECT($H$6)=H11),0),1)=J11,\"Nhập đúng\",\"Nhập sai\"),\"\")","v":""}]
[5,0,null,"OFF","OFF",{"$f":"#N/A","v":{"$error":"#N/A"}},"lỗi",null,{"$f":"INDEX('3.TTNV'!$D:$D,MATCH('2. QT_LV'!H12,'3.TTNV'!$C:$C,0),1)","v":""},{"$f":"#N/A","v":"02. Phòng Hành chính - Nhân sự00"},null,null,null,null,null,null,"00/01/1900","00/01/1900",{"$f":"IFERROR(VLOOKUP(T12,Define!$B$18:$C$22,2,0),\"\")&\nIFERROR(VLOOKUP(U12,Define!$D$18:$E$22,2,0),\"\")","v":""},null,null,"","Không",{"$f":"IF(AND(OR(\nIFERROR(INDEX(INDIRECT($T$6),MATCH(1,(INDIRECT($H$6)=H12)*(INDIRECT($B$6)=B12+1),0),1),\"\")=\"Thay đổi đơn vị\",\nIFERROR(INDEX(INDIRECT($T$6),MATCH(1,(INDIRECT($H$6)=H12)*(INDIRECT($B$6)=B12+1),0),1),\"\")=\"Thay đổi chức danh\"),\n\nIFERROR(INDEX(INDIRECT($O$6),MATCH(1,(INDIRECT($H$6)=H12)*(INDIRECT($B$6)=B12+1),0),1),\"\")<=$K$3),\n\"Có\",\"Không\")","v":"Không"},1,{"$f":"INDEX('3.TTNV'!E:E,MATCH(H12,'3.TTNV'!C:C,0),1)","v":""},{"$f":"INDEX('3.TTNV'!AE:AE,MATCH(H12,'3.TTNV'!C:C,0),1)","v":0},{"$f":"INDEX('3.TTNV'!Q:Q,MATCH(I12,'3.TTNV'!D:D,0),1)","v":""},false,1,{"$f":"IF(AND(\nINDEX('1. QT_ĐV'!$G:$G,MATCH(J12,'1. QT_ĐV'!$C:$C,0),1)<=O12=TRUE,\nINDEX('1. QT_ĐV'!$H:$H,MATCH(J12,'1. QT_ĐV'!$C:$C,0),1)>=O12=TRUE),\"Nhập đúng\",\"Nhập sai\")","v":"Nhập sai"},{"$f":"IF(C12=\"Đã nghỉ việc\",\nIF(INDEX(INDIRECT($J$6),MATCH(1,(INDIRECT($B$6)=B12-1)*(INDIRECT($H$6)=H12),0),1)=J12,\"Nhập đúng\",\"Nhập sai\"),\"\")","v":""}]

{"sheet":"1. QT_ĐV","index":7,"n_rows":39,"n_cols":24,"rows_kept":39,"cut":false,"hidden":false,"merged":[[2,1,2,2]]}
["THEO DÕI QUÁ TRÌNH ĐƠN VỊ",null,null,null,null,null,null,null,"Bằng 0 là đúng"]
[]
[null,"Kỳ theo dõi: Từ ngày",null,{"$f":"'4.Report'!H4","v":"2019-07-01"},"Đến ngày",{"$f":"'4.Report'!L4","v":"2019-07-31"},null,null,{"$f":"COUNTIF(I9:I46,\"False\")","v":1}]
[]
["CT","CT","CT","Điền","Điền","Điền","Điền","Điền","CT","CT","CT","Điền","CT","CT","CT","CT","CT","CT","CT","CT","CT","CT","CT","CT"]
[{"$f":"ADDRESS(ROW($A$9),1,1,1,\"1. QT_ĐV\") & \":\" & ADDRESS(MAX('1. QT_ĐV'!A9:A46)+6,1,1,1)","v":"'1. QT_ĐV'!$A$9:$A$37"},{"$f":"SUBSTITUTE($A$6,\"$A$\",\"$\"&LEFT(ADDRESS(1,COLUMN(),4,1),LEN(ADDRESS(1,COLUMN(),4,1))-1)&\"$\")","v":"'1. QT_ĐV'!$B$9:$B$37"},{"$f":"SUBSTITUTE($A$6,\"$A$\",\"$\"&LEFT(ADDRESS(1,COLUMN(),4,1),LEN(ADDRESS(1,COLUMN(),4,1))-1)&\"$\")","v":"'1. QT_ĐV'!$C$9:$C$37"},"'1. QT_ĐV'!$D$9:$D$37","'1. QT_ĐV'!$E$9:$E$37","'1. QT_ĐV'!$F$9:$F$37","'1. QT_ĐV'!$G$9:$G$37","'1. QT_ĐV'!$H$9:$H$37","'1. QT_ĐV'!$I$9:$I$37","'1. QT_ĐV'!$J$9:$J$37","'1. QT_ĐV'!$K$9:$K$37","'1. QT_ĐV'!$L$9:$L$37","'1. QT_ĐV'!$M$9:$M$37","'1. QT_ĐV'!$N$9:$N$37","'1. QT_ĐV'!$O$9:$O$37","'1. QT_ĐV'!$P$9:$P$37","'1. QT_ĐV'!$Q$9:$Q$37",{"$f":"SUBSTITUTE($A$6,\"$A$\",\"$\"&LEFT(ADDRESS(1,COLUMN(),4,1),LEN(ADDRESS(1,COLUMN(),4,1))-1)&\"$\")","v":"'1. QT_ĐV'!$R$9:$R$37"},"'1. QT_ĐV'!$S$9:$S$37","'1. QT_ĐV'!$T$9:$T$37","'1. QT_ĐV'!$U$9:$U$37","'1. QT_ĐV'!$V$9:$V$37","'1. QT_ĐV'!$W$9:$W$37","'1. QT_ĐV'!$X$9:$X$37"]
["STT","Trạng thái cả quá trình","Mã Đơn vị","Phòng","Bộ phận","Nhóm","Từ ngày","Đến ngày","Check Từ ngày - Đến ngày","Từ ngày (TEXT)","Đến ngày (TEXT)","Lý do kết thúc","Phòng","Bộ phận","Nhóm","Gộp tên đơn vị","Lọc ra giá trị duy nhất","Thứ tự nháp","Sắp xếp","Vị trí dấu * thứ 1","Vị trí dấu * thứ 2","Phòng","Bộ phận","Nhóm"]
["Số thứ tự","- ON: Đơn vị đó đang trong trạng thái hoạt động\n- OFF: Đơn vị đó đang trong trạng thái không hoạt động","Mã Đơn vị","Tên đơn vị cấp 1","Tên đơn vị cấp 2","Tên đơn vị cấp 3","Ngày bắt đầu hoạt động của đơn vị","Ngày cuối cùng hoạt động của đơn vị\n(31/12/2100 nếu chưa có ngày kết thúc)","Kiểm tra tính đúng đắn của Từ ngày dến ngày","Chuyển \"từ ngày\" thành text","Chuyển \"đến ngày\" thành text","Nhập lý do kết thúc của 1 quá trình","Nháp: Chỉ lấy TH ON","Nháp: Chỉ lấy TH ON","Nháp: Chỉ lấy TH ON","Nháp: Gộp Công ty + Phòng + Nhóm đang ở trạng thái On","Lọc ra giá trị duy nhất","So sánh cả chuỗi ký tự để ra thứ tự A đến Z","Sắp xếp lại Phòng/Bộ phận/Nhóm theo thứ tự A đến Z","Vị trí dấu * thứ 1","Vị trí dấu * thứ 2","Đơn vị cấp 1 tại thời điểm đang theo dõi","Đơn vị cấp 2 tại thời điểm đang theo dõi","Đơn vị cấp 3 tại thời điểm đang theo dõi"]
[{"$f":"ROW()-ROW($A$8)","v":1},{"$f":"IF(AND($D$3<$F$3,G9<H9)=TRUE,\nIF(OR($F$3<G9,H9<$D$3)=TRUE,\"OFF\",\"ON\"),\"lỗi\")","v":"ON"},{"$f":"D9&E9&F9","v":"01. Ban giám đốc00"},"01. Ban giám đốc","0","0","2016-01-01","2100-12-31",{"$f":"H9>G9","v":true},{"$f":"TEXT(DAY(G9),\"00\")&\"/\"&TEXT(MONTH(G9),\"00\")&\"/\"&YEAR(G9)","v":"01/01/2016"},"31/12/2100",null,{"$f":"IF($B9=\"ON\",D9,\"\")","v":"01. Ban giám đốc"},"0","0",{"$f":"IF(B9=\"ON\",M9&\"*\"&N9&\"*\"&O9,\"\")","v":"01. Ban giám đốc*0*0"},{"$f":"IFERROR(INDEX(INDIRECT($P$6),MATCH(0,COUNTIF($Q$8:Q8,INDIRECT($P$6)),0)),\"a\")","v":"01. Ban giám đốc*0*0"},{"$f":"COUNTIFS(INDIRECT($Q$6),\"<>a\",INDIRECT($Q$6),\"<=\"&Q9)*IF(Q9=\"a\",0,1)","v":2},{"$f":"IFERROR(INDEX(INDIRECT($Q$6),MATCH(A9,INDIRECT($R$6),0),1),\"\")","v":""},{"$f":"IFERROR(FIND(\"*\",S9),0)","v":0},{"$f":"IFERROR(FIND(\"*\",S9,FIND(\"*\",S9)+1),0)","v":0},{"$f":"IFERROR(LEFT(S9,FIND(\"*\",S9)-1),\"\")","v":""},{"$f":"IF(S9=\"\",\"\",\nIF(U9=0,\"0\",MID(S9,T9+1,U9-T9-1)))","v":""},{"$f":"IF(S9=\"\",\"\",\nIF(U9=0,\nRIGHT(S9,LEN(S9)-T9),\nRIGHT(S9,LEN(S9)-U9)))","v":""}]
[2,"ON","02. Phòng Hành chính - Nhân sự00","02. Phòng Hành chính - Nhân sự","0","0","2016-01-01","2100-12-31",true,{"$f":"TEXT(DAY(G10),\"00\")&\"/\"&TEXT(MONTH(G10),\"00\")&\"/\"&YEAR(G10)","v":"01/01/2016"},"31/12/2100",null,"02. Phòng Hành chính - Nhân sự","0","0","02. Phòng Hành chính - Nhân sự*0*0",{"$f":"IFERROR(INDEX(INDIRECT($P$6),MATCH(0,COUNTIF($Q$8:Q9,INDIRECT($P$6)),0)),\"a\")","v":"02. Phòng Hành chính - Nhân sự*0*0"},{"$f":"COUNTIFS(INDIRECT($Q$6),\"<>a\",INDIRECT($Q$6),\"<=\"&Q10)*IF(Q10=\"a\",0,1)","v":3},{"$f":"IFERROR(INDEX(INDIRECT($Q$6),MATCH(A10,INDIRECT($R$6),0),1),\"\")","v":"01. Ban giám đốc*0*0"},17,19,"01. Ban giám đốc","0","0"]
[3,"ON","03. Phòng Kế toán00","03. Phòng Kế toán","0","0","2016-01-01","2100-12-31",true,{"$f":"TEXT(DAY(G11),\"00\")&\"/\"&TEXT(MONTH(G11),\"00\")&\"/\"&YEAR(G11)","v":"01/01/2016"},"31/12/2100",null,{"$f":"IF($B11=\"ON\",D11,\"\")","v":"03. Phòng Kế toán"},"0","0","03. Phòng Kế toán*0*0",{"$f":"IFERROR(INDEX(INDIRECT($P$6),MATCH(0,COUNTIF($Q$8:Q10,INDIRECT($P$6)),0)),\"a\")","v":"03. Phòng Kế toán*0*0"},4,"02. Phòng Hành chính - Nhân sự*0*0",31,33,"02. Phòng Hành chính - Nhân sự","0","0"]
[4,"ON","03. Phòng Kế toán0Kho","03. Phòng Kế toán","0","Kho","2016-01-01","2100-12-31",true,{"$f":"TEXT(DAY(G12),\"00\")&\"/\"&TEXT(MONTH(G12),\"00\")&\"/\"&YEAR(G12)","v":"01/01/2016"},"31/12/2100",null,{"$f":"IF($B12=\"ON\",D12,\"\")","v":"03. Phòng Kế toán"},"0","Kho","03. Phòng Kế toán*0*Kho",{"$f":"IFERROR(INDEX(INDIRECT($P$6),MATCH(0,COUNTIF($Q$8:Q11,INDIRECT($P$6)),0)),\"a\")","v":"03. Phòng Kế toán*0*Kho"},5,"03. Phòng Kế toán*0*0",18,20,"03. Phòng Kế toán","0","0"]
[5,"ON","04. Phòng Kinh doanh00","04. Phòng Kinh doanh","0","0","2016-01-01","2100-12-31",true,{"$f":"TEXT(DAY(G13),\"00\")&\"/\"&TEXT(MONTH(G13),\"00\")&\"/\"&YEAR(G13)","v":"01/01/2016"},"31/12/2100",null,{"$f":"IF($B13=\"ON\",D13,\"\")","v":"04. Phòng Kinh doanh"},"0","0","04. Phòng Kinh doanh*0*0",{"$f":"IFERROR(INDEX(INDIRECT($P$6),MATCH(0,COUNTIF($Q$8:Q12,INDIRECT($P$6)),0)),\"a\")","v":"04. Phòng Kinh doanh*0*0"},6,"03. Phòng Kế toán*0*Kho",18,20,"03. Phòng Kế toán","0","Kho"]
[6,"ON","04. Phòng Kinh doanh0Nhóm Sale","04. Phòng Kinh doanh","0","Nhóm Sale","2016-01-01","2100-12-31",true,{"$f":"TEXT(DAY(G14),\"00\")&\"/\"&TEXT(MONTH(G14),\"00\")&\"/\"&YEAR(G14)","v":"01/01/2016"},"31/12/2100",null,{"$f":"IF($B14=\"ON\",D14,\"\")","v":"04. Phòng Kinh doanh"},"0","Nhóm Sale","04. Phòng Kinh doanh*0*Nhóm Sale",{"$f":"IFERROR(INDEX(INDIRECT($P$6),MATCH(0,COUNTIF($Q$8:Q13,INDIRECT($P$6)),0)),\"a\")","v":"04. Phòng Kinh doanh*0*Nhóm Sale"},9,"04. Phòng Kinh doanh*0*0",21,23,"04. Phòng Kinh doanh","0","0"]
[7,"ON","04. Phòng Kinh doanh0Nhóm Pancake","04. Phòng Kinh doanh","0","Nhóm Pancake","2016-01-01","2100-12-31",true,{"$f":"TEXT(DAY(G15),\"00\")&\"/\"&TEXT(MONTH(G15),\"00\")&\"/\"&YEAR(G15)","v":"01/01/2016"},"31/12/2100",null,{"$f":"IF($B15=\"ON\",D15,\"\")","v":"04. Phòng Kinh doanh"},"0","Nhóm Pancake","04. Phòng Kinh doanh*0*Nhóm Pancake",{"$f":"IFERROR(INDEX(INDIRECT($P$6),MATCH(0,COUNTIF($Q$8:Q14,INDIRECT($P$6)),0)),\"a\")","v":"04. Phòng Kinh doanh*0*Nhóm Pancake"},8,"04. Phòng Kinh doanh*0*Nhóm Care",21,23,"04. Phòng Kinh doanh","0","Nhóm Care"]
[8,"ON","04. Phòng Kinh doanh0Nhóm Care","04. Phòng Kinh doanh","0","Nhóm Care","2016-01-01","2100-12-31",true,{"$f":"TEXT(DAY(G16),\"00\")&\"/\"&TEXT(MONTH(G16),\"00\")&\"/\"&YEAR(G16)","v":"01/01/2016"},"31/12/2100",null,{"$f":"IF($B16=\"ON\",D16,\"\")","v":"04. Phòng Kinh doanh"},"0","Nhóm Care","04. Phòng Kinh doanh*0*Nhóm Care",{"$f":"IFERROR(INDEX(INDIRECT($P$6),MATCH(0,COUNTIF($Q$8:Q15,INDIRECT($P$6)),0)),\"a\")","v":"04. Phòng Kinh doanh*0*Nhóm Care"},7,"04. Phòng Kinh doanh*0*Nhóm Pancake",21,23,"04. Phòng Kinh doanh","0","Nhóm Pancake"]
[9,"ON","04. Phòng Kinh doanh0Nhóm Sale Admin","04. Phòng Kinh doanh","0","Nhóm Sale Admin","2016-01-01","2100-12-31",true,{"$f":"TEXT(DAY(G17),\"00\")&\"/\"&TEXT(MONTH(G17),\"00\")&\"/\"&YEAR(G17)","v":"01/01/2016"},"31/12/2100",null,{"$f":"IF($B17=\"ON\",D17,\"\")","v":"04. Phòng Kinh doanh"},"0","Nhóm Sale Admin","04. Phòng Kinh doanh*0*Nhóm Sale Admin",{"$f":"IFERROR(INDEX(INDIRECT($P$6),MATCH(0,COUNTIF($Q$8:Q16,INDIRECT($P$6)),0)),\"a\")","v":"04. Phòng Kinh doanh*0*Nhóm Sale Admin"},10,"04. Phòng Kinh doanh*0*Nhóm Sale",21,23,"04. Phòng Kinh doanh","0","Nhóm Sale"]
[10,"ON","04. Phòng Marketing00","04. Phòng Marketing","0","0","2016-01-01","2100-12-31",true,{"$f":"TEXT(DAY(G18),\"00\")&\"/\"&TEXT(MONTH(G18),\"00\")&\"/\"&YEAR(G18)","v":"01/01/2016"},"31/12/2100",null,{"$f":"IF($B18=\"ON\",D18,\"\")","v":"04. Phòng Marketing"},"0","0","04. Phòng Marketing*0*0",{"$f":"IFERROR(INDEX(INDIRECT($P$6),MATCH(0,COUNTIF($Q$8:Q17,INDIRECT($P$6)),0)),\"a\")","v":"04. Phòng Marketing*0*0"},11,"04. Phòng Kinh doanh*0*Nhóm Sale Admin",21,23,"04. Phòng Kinh doanh","0","Nhóm Sale Admin"]
[11,"ON","04. Phòng Marketing0Nhóm Plan","04. Phòng Marketing","0","Nhóm Plan","2016-01-01","2019-10-31",true,{"$f":"TEXT(DAY(G19),\"00\")&\"/\"&TEXT(MONTH(G19),\"00\")&\"/\"&YEAR(G19)","v":"01/01/2016"},"31/10/2019","Tái cơ cấu, thay đổi đơn vị",{"$f":"IF($B19=\"ON\",D19,\"\")","v":"04. Phòng Marketing"},"0","Nhóm Plan","04. Phòng Marketing*0*Nhóm Plan",{"$f":"IFERROR(INDEX(INDIRECT($P$6),MATCH(0,COUNTIF($Q$8:Q18,INDIRECT($P$6)),0)),\"a\")","v":"04. Phòng Marketing*0*Nhóm Plan"},14,"04. Phòng Marketing*0*0",20,22,"04. Phòng Marketing","0","0"]
[12,"ON","04. Phòng Marketing0Nhóm Kênh","04. Phòng Marketing","0","Nhóm Kênh","2016-01-01","2019-10-31",true,{"$f":"TEXT(DAY(G20),\"00\")&\"/\"&TEXT(MONTH(G20),\"00\")&\"/\"&YEAR(G20)","v":"01/01/2016"},"31/10/2019","Tái cơ cấu, thay đổi đơn vị",{"$f":"IF($B20=\"ON\",D20,\"\")","v":"04. Phòng Marketing"},"0","Nhóm Kênh","04. Phòng Marketing*0*Nhóm Kênh",{"$f":"IFERROR(INDEX(INDIRECT($P$6),MATCH(0,COUNTIF($Q$8:Q19,INDIRECT($P$6)),0)),\"a\")","v":"04. Phòng Marketing*0*Nhóm Kênh"},13,"04. Phòng Marketing*0*Nhóm Ads",20,22,"04. Phòng Marketing","0","Nhóm Ads"]
[13,"ON","04. Phòng Marketing0Nhóm Tiếp thị","04. Phòng Marketing","0","Nhóm Tiếp thị","2016-01-01","2019-10-31",true,{"$f":"TEXT(DAY(G21),\"00\")&\"/\"&TEXT(MONTH(G21),\"00\")&\"/\"&YEAR(G21)","v":"01/01/2016"},"31/10/2019","Tái cơ cấu, thay đổi đơn vị",{"$f":"IF($B21=\"ON\",D21,\"\")","v":"04. Phòng Marketing"},"0","Nhóm Tiếp thị","04. Phòng Marketing*0*Nhóm Tiếp thị",{"$f":"IFERROR(INDEX(INDIRECT($P$6),MATCH(0,COUNTIF($Q$8:Q20,INDIRECT($P$6)),0)),\"a\")","v":"04. Phòng Marketing*0*Nhóm Tiếp thị"},15,"04. Phòng Marketing*0*Nhóm Kênh",20,22,"04. Phòng Marketing","0","Nhóm Kênh"]
[14,"ON","04. Phòng Marketing0Nhóm Thiết kế","04. Phòng Marketing","0","Nhóm Thiết kế","2016-01-01","2019-10-31",true,{"$f":"TEXT(DAY(G22),\"00\")&\"/\"&TEXT(MONTH(G22),\"00\")&\"/\"&YEAR(G22)","v":"01/01/2016"},"31/10/2019","Tái cơ cấu, thay đổi đơn vị",{"$f":"IF($B22=\"ON\",D22,\"\")","v":"04. Phòng Marketing"},"0","Nhóm Thiết kế","04. Phòng Marketing*0*Nhóm Thiết kế",{"$f":"IFERROR(INDEX(INDIRECT($P$6),MATCH(0,COUNTIF($Q$8:Q21,INDIRECT($P$6)),0)),\"a\")","v":"04. Phòng Marketing*0*Nhóm Thiết kế"},16,"04. Phòng Marketing*0*Nhóm Plan",20,22,"04. Phòng Marketing","0","Nhóm Plan"]
[15,"ON","04. Phòng Marketing0Nhóm Truyền thông","04. Phòng Marketing","0","Nhóm Truyền thông","2016-01-01","2019-10-31",true,{"$f":"TEXT(DAY(G23),\"00\")&\"/\"&TEXT(MONTH(G23),\"00\")&\"/\"&YEAR(G23)","v":"01/01/2016"},"31/10/2019","Tái cơ cấu, thay đổi đơn vị",{"$f":"IF($B23=\"ON\",D23,\"\")","v":"04. Phòng Marketing"},"0","Nhóm Truyền thông","04. Phòng Marketing*0*Nhóm Truyền thông",{"$f":"IFERROR(INDEX(INDIRECT($P$6),MATCH(0,COUNTIF($Q$8:Q22,INDIRECT($P$6)),0)),\"a\")","v":"04. Phòng Marketing*0*Nhóm Truyền thông"},17,"04. Phòng Marketing*0*Nhóm Tiếp thị",20,22,"04. Phòng Marketing","0","Nhóm Tiếp thị"]
[16,"ON","04. Phòng Marketing0Nhóm Ads","04. Phòng Marketing","0","Nhóm Ads","2016-11-01","2020-08-31",true,{"$f":"TEXT(DAY(G24),\"00\")&\"/\"&TEXT(MONTH(G24),\"00\")&\"/\"&YEAR(G24)","v":"01/11/2016"},"31/08/2020","Tái cơ cấu, thay đổi đơn vị",{"$f":"IF($B24=\"ON\",D24,\"\")","v":"04. Phòng Marketing"},"0","Nhóm Ads","04. Phòng Marketing*0*Nhóm Ads",{"$f":"IFERROR(INDEX(INDIRECT($P$6),MATCH(0,COUNTIF($Q$8:Q23,INDIRECT($P$6)),0)),\"a\")","v":"04. Phòng Marketing*0*Nhóm Ads"},12,"04. Phòng Marketing*0*Nhóm Thiết kế",20,22,"04. Phòng Marketing","0","Nhóm Thiết kế"]
[17,"OFF","04. Phòng Marketing0Nhóm Design","04. Phòng Marketing","0","Nhóm Design","2019-11-01","2020-08-31",true,{"$f":"TEXT(DAY(G25),\"00\")&\"/\"&TEXT(MONTH(G25),\"00\")&\"/\"&YEAR(G25)","v":"01/11/2019"},"31/08/2020","Tái cơ cấu, thay đổi đơn vị",{"$f":"IF($B25=\"ON\",D25,\"\")","v":""},"","","",{"$f":"IFERROR(INDEX(INDIRECT($P$6),MATCH(0,COUNTIF($Q$8:Q24,INDIRECT($P$6)),0)),\"a\")","v":""},0,"04. Phòng Marketing*0*Nhóm Truyền thông",20,22,"04. Phòng Marketing","0","Nhóm Truyền thông"]
[18,"OFF","04. Phòng Marketing0Nhóm Content","04. Phòng Marketing","0","Nhóm Content","2019-11-01","2020-08-31",true,{"$f":"TEXT(DAY(G26),\"00\")&\"/\"&TEXT(MONTH(G26),\"00\")&\"/\"&YEAR(G26)","v":"01/11/2019"},"31/08/2020","Tái cơ cấu, thay đổi đơn vị",{"$f":"IF($B26=\"ON\",D26,\"\")","v":""},"","","",{"$f":"IFERROR(INDEX(INDIRECT($P$6),MATCH(0,COUNTIF($Q$8:Q25,INDIRECT($P$6)),0)),\"a\")","v":"a"},0,"",0,0,"","",""]
[19,"OFF","04. Phòng MarketingBộ phận Content0","04. Phòng Marketing","Bộ phận Content","0","2020-09-01","2100-12-31",true,{"$f":"TEXT(DAY(G27),\"00\")&\"/\"&TEXT(MONTH(G27),\"00\")&\"/\"&YEAR(G27)","v":"01/09/2020"},"31/12/2100","Tái cơ cấu, thay đổi đơn vị",{"$f":"IF($B27=\"ON\",D27,\"\")","v":""},"","","",{"$f":"IFERROR(INDEX(INDIRECT($P$6),MATCH(0,COUNTIF($Q$8:Q26,INDIRECT($P$6)),0)),\"a\")","v":"a"},0,"",0,0,"","",""]
[20,"OFF","04. Phòng MarketingBộ phận ContentNhóm Media","04. Phòng Marketing","Bộ phận Content","Nhóm Media","2020-09-01","2100-12-31",true,{"$f":"TEXT(DAY(G28),\"00\")&\"/\"&TEXT(MONTH(G28),\"00\")&\"/\"&YEAR(G28)","v":"01/09/2020"},"31/12/2100","Tái cơ cấu, thay đổi đơn vị",{"$f":"IF($B28=\"ON\",D28,\"\")","v":""},"","","",{"$f":"IFERROR(INDEX(INDIRECT($P$6),MATCH(0,COUNTIF($Q$8:Q27,INDIRECT($P$6)),0)),\"a\")","v":"a"},0,"",0,0,"","",""]
[21,"OFF","04. Phòng MarketingBộ phận ContentNhóm Branding - PR - Content MXH","04. Phòng Marketing","Bộ phận Content","Nhóm Branding - PR - Content MXH","2020-09-01","2100-12-31",true,{"$f":"TEXT(DAY(G29),\"00\")&\"/\"&TEXT(MONTH(G29),\"00\")&\"/\"&YEAR(G29)","v":"01/09/2020"},"31/12/2100","Tái cơ cấu, thay đổi đơn vị",{"$f":"IF($B29=\"ON\",D29,\"\")","v":""},"","","",{"$f":"IFERROR(INDEX(INDIRECT($P$6),MATCH(0,COUNTIF($Q$8:Q28,INDIRECT($P$6)),0)),\"a\")","v":"a"},0,"",0,0,"","",""]
[22,"OFF","04. Phòng MarketingBộ phận ContentNhóm Content SEO","04. Phòng Marketing","Bộ phận Content","Nhóm Content SEO","2020-09-01","2100-12-31",true,{"$f":"TEXT(DAY(G30),\"00\")&\"/\"&TEXT(MONTH(G30),\"00\")&\"/\"&YEAR(G30)","v":"01/09/2020"},"31/12/2100","Tái cơ cấu, thay đổi đơn vị",{"$f":"IF($B30=\"ON\",D30,\"\")","v":""},"","","",{"$f":"IFERROR(INDEX(INDIRECT($P$6),MATCH(0,COUNTIF($Q$8:Q29,INDIRECT($P$6)),0)),\"a\")","v":"a"},0,"",0,0,"","",""]
[23,"OFF","04. Phòng MarketingBộ phận ContentNhóm Social Selling - Seeding","04. Phòng Marketing","Bộ phận Content","Nhóm Social Selling - Seeding","2020-09-01","2100-12-31",true,{"$f":"TEXT(DAY(G31),\"00\")&\"/\"&TEXT(MONTH(G31),\"00\")&\"/\"&YEAR(G31)","v":"01/09/2020"},"31/12/2100","Tái cơ cấu, thay đổi đơn vị",{"$f":"IF($B31=\"ON\",D31,\"\")","v":""},"","","",{"$f":"IFERROR(INDEX(INDIRECT($P$6),MATCH(0,COUNTIF($Q$8:Q30,INDIRECT($P$6)),0)),\"a\")","v":"a"},0,"",0,0,"","",""]
[24,"OFF","04. Phòng MarketingBộ phận ContentNhóm Content Bán hàng","04. Phòng Marketing","Bộ phận Content","Nhóm Content Bán hàng","2020-09-01","2100-12-31",true,{"$f":"TEXT(DAY(G32),\"00\")&\"/\"&TEXT(MONTH(G32),\"00\")&\"/\"&YEAR(G32)","v":"01/09/2020"},"31/12/2100","Tái cơ cấu, thay đổi đơn vị",{"$f":"IF($B32=\"ON\",D32,\"\")","v":""},"","","",{"$f":"IFERROR(INDEX(INDIRECT($P$6),MATCH(0,COUNTIF($Q$8:Q31,INDIRECT($P$6)),0)),\"a\")","v":"a"},0,"",0,0,"","",""]
[25,"OFF","04. Phòng MarketingBộ phận Kênh0","04. Phòng Marketing","Bộ phận Kênh","0","2020-09-01","2100-12-31",true,{"$f":"TEXT(DAY(G33),\"00\")&\"/\"&TEXT(MONTH(G33),\"00\")&\"/\"&YEAR(G33)","v":"01/09/2020"},"31/12/2100","Tái cơ cấu, thay đổi đơn vị",{"$f":"IF($B33=\"ON\",D33,\"\")","v":""},"","","",{"$f":"IFERROR(INDEX(INDIRECT($P$6),MATCH(0,COUNTIF($Q$8:Q32,INDIRECT($P$6)),0)),\"a\")","v":"a"},0,"",0,0,"","",""]
[26,"OFF","04. Phòng MarketingBộ phận KênhNhóm Ads Vận hành","04. Phòng Marketing","Bộ phận Kênh","Nhóm Ads Vận hành","2020-09-01","2100-12-31",true,{"$f":"TEXT(DAY(G34),\"00\")&\"/\"&TEXT(MONTH(G34),\"00\")&\"/\"&YEAR(G34)","v":"01/09/2020"},"31/12/2100","Tái cơ cấu, thay đổi đơn vị",{"$f":"IF($B34=\"ON\",D34,\"\")","v":""},"","","",{"$f":"IFERROR(INDEX(INDIRECT($P$6),MATCH(0,COUNTIF($Q$8:Q33,INDIRECT($P$6)),0)),\"a\")","v":"a"},0,"",0,0,"","",""]
[27,"OFF","04. Phòng MarketingBộ phận KênhNhóm R&D kênh mới","04. Phòng Marketing","Bộ phận Kênh","Nhóm R&D kênh mới","2020-09-01","2100-12-31",true,{"$f":"TEXT(DAY(G35),\"00\")&\"/\"&TEXT(MONTH(G35),\"00\")&\"/\"&YEAR(G35)","v":"01/09/2020"},"31/12/2100","Tái cơ cấu, thay đổi đơn vị",{"$f":"IF($B35=\"ON\",D35,\"\")","v":""},"","","",{"$f":"IFERROR(INDEX(INDIRECT($P$6),MATCH(0,COUNTIF($Q$8:Q34,INDIRECT($P$6)),0)),\"a\")","v":"a"},0,"",0,0,"","",""]
[28,"OFF","04. Phòng MarketingBộ phận KênhNhóm CRM - Ecom","04. Phòng Marketing","Bộ phận Kênh","Nhóm CRM - Ecom","2020-09-01","2100-12-31",true,{"$f":"TEXT(DAY(G36),\"00\")&\"/\"&TEXT(MONTH(G36),\"00\")&\"/\"&YEAR(G36)","v":"01/09/2020"},"31/12/2100","Tái cơ cấu, thay đổi đơn vị",{"$f":"IF($B36=\"ON\",D36,\"\")","v":""},"","","",{"$f":"IFERROR(INDEX(INDIRECT($P$6),MATCH(0,COUNTIF($Q$8:Q35,INDIRECT($P$6)),0)),\"a\")","v":"a"},0,"",0,0,"","",""]
[29,"OFF","04. Phòng MarketingBộ phận KênhNhóm Kỹ thuật SEO","04. Phòng Marketing","Bộ phận Kênh","Nhóm Kỹ thuật SEO","2020-09-01","2100-12-31",true,{"$f":"TEXT(DAY(G37),\"00\")&\"/\"&TEXT(MONTH(G37),\"00\")&\"/\"&YEAR(G37)","v":"01/09/2020"},"31/12/2100","Tái cơ cấu, thay đổi đơn vị",{"$f":"IF($B37=\"ON\",D37,\"\")","v":""},"","","",{"$f":"IFERROR(INDEX(INDIRECT($P$6),MATCH(0,COUNTIF($Q$8:Q36,INDIRECT($P$6)),0)),\"a\")","v":"a"},0,"",0,0,"","",""]
[30,"OFF","04. Phòng MarketingBộ phận KênhNhóm Trade Marketing","04. Phòng Marketing","Bộ phận Kênh","Nhóm Trade Marketing","2020-09-01","2100-12-31",true,{"$f":"TEXT(DAY(G38),\"00\")&\"/\"&TEXT(MONTH(G38),\"00\")&\"/\"&YEAR(G38)","v":"01/09/2020"},"31/12/2100","Tái cơ cấu, thay đổi đơn vị",{"$f":"IF($B38=\"ON\",D38,\"\")","v":""},"","","",{"$f":"IFERROR(INDEX(INDIRECT($P$6),MATCH(0,COUNTIF($Q$8:Q37,INDIRECT($P$6)),0)),\"a\")","v":"a"},0,"",0,0,"","",""]
[31,"lỗi","",null,null,null,null,null,false,"00/01/1900","00/01/1900",null,"","","","",{"$f":"IFERROR(INDEX(INDIRECT($P$6),MATCH(0,COUNTIF($Q$8:Q38,INDIRECT($P$6)),0)),\"a\")","v":"a"},0,"",0,0,"","",""]

{"sheet":"DSNV_Import","index":8,"n_rows":4,"n_cols":30,"rows_kept":4,"cut":false,"hidden":false,"merged":[]}
[]
[]
["MSNV","Họ và tên","Giới tính","Ngày sinh","Nơi sinh","Địa chỉ thường trú","Địa chỉ hiện tại","Số điện thoại","E-mail","Tình trạng hôn nhân","Vợ/chồng","Năm sinh vợ/chồng","Con thứ 1","Năm sinh con thứ 1","Con thứ 2","Năm sinh con thứ 2","Con thứ 3","Năm sinh con thứ 3","Số CMND","Ngày cấp","Nơi cấp","Mã số thuế TNCN","Số người phụ thuộc","Trình độ","Chuyên ngành","Trường","Loại thanh toán lương","Họ tên chuyển khoản","Số tài khoản","Ngân hàng"]
[170415,"Đàm Anh Tú","Nam","1991-06-07","Hà Nội","Số 123, Ðường ABC, Phường Tân Mai, Quận Hoàng Mai, Tp Hà Nội","Số 123, Ðường ABC, Phường Tân Mai, Quận Hoàng Mai, Tp Hà Nội","0934.123.321","nguyenvana@gmail.com","Độc thân",null,null,null,null,null,null,null,null,123456789,"2010-12-21","Hà Nội","123345456767",3,"Đại học","Kinh tế lao động","NEU","Tiền Mặt"]