{"text_format":"1","workbook":"xlsx","n_sheets":9,"sheets":["HDSD","Define","5.Dashboard","DB_Data","4.Report","3.TTNV","2. QT_LV","1. QT_ĐV","DSNV_Import"],"not_rendered":{"charts":10,"images":0,"macros":1,"external_links":0,"defined_names":14,"comments":2,"pivot_tables":0},"unopened":[],"bounds":{"document_bytes":16777216,"sheet_cells":100000,"rows_first":2000,"rows_last":500,"rows_between":2000,"halvings":0,"cell_chars":16384,"cell_head_chars":4096},"cells_cut":0,"cells_raw":0,"read":"whole","date_system":"1900"}

{"sheet":"HDSD","index":0,"n_rows":76,"n_cols":17,"rows_kept":76,"cut":false,"hidden":false,"merged":[[1,16,1,18],[2,16,15,18],[13,2,13,13],[16,2,16,13],[1,1,1,14],[3,2,3,13],[5,2,5,13],[12,2,12,13],[11,2,11,13],[8,1,8,14],[10,2,10,13],[14,2,14,13],[39,1,39,14],[71,1,71,14],[17,1,17,14],[30,1,30,14],[19,2,19,13],[20,2,20,13],[21,2,21,13],[27,2,27,13],[22,2,22,13],[23,2,23,13],[24,2,24,13],[25,2,25,13],[26,2,26,13]]}
[]
[null,"...UPCOMING VERSION 8",null,null,null,null,null,null,null,null,null,null,null,null,null,null,"LƯU Ý"]
[null,null,null,null,null,null,null,null,null,null,null,null,null,null,null,null,"File có sử dụng công thức mảng. Để sử dụng tốt nhất với file này. Hãy:\n\n1. Chuyển từ chế độ tính toán tự động sang chế độ tính toán bằng tay (khi nào ấn F9 bảng Excel mới tính toán lại)\nHướng dẫn: Tab Formulas\\Calculation Options\\Manual\n\n2. Tuân thủ các nguyên tắc nhập liệu, sai 1 ly, sẽ không ra kết quả. Vì vậy, cần phải có kỹ năng Excel tốt"]
[null,null,"- Bổ sung Nút \"Thêm mới đơn vị\" và \"Thêm mới quá trình\" dùng VBA"]
[null,null,"- Bổ sung tính năng xem thông tin nhân viên bằng VBA"]
[]
{"$rows_left_out":71}
{"sheet":"Define","index":1,"n_rows":22,"n_cols":8,"rows_kept":22,"cut":false,"hidden":false,"merged":[]}
["Tháng thay đổi theo năm chọn",null,"Năm2019","Năm2020","Năm2021","Năm2022","Năm2023","Năm2024"]
[{"$f":"INDIRECT('4.Report'!D4)","v":"2019-01-01"},1,{"$f":"DATE(VALUE(RIGHT(C$1,4)),$B2,1)","v":"2019-01-01"},{"$f":"DATE(VALUE(RIGHT(D$1,4)),$B2,1)","v":"2020-01-01"},"2021-01-01","2022-01-01","2023-01-01","2024-01-01"]
["2019-02-01",2,{"$f":"DATE(VALUE(RIGHT(C$1,4)),$B3,1)","v":"2019-02-01"},"2020-02-01","2021-02-01","2022-02-01","2023-02-01","2024-02-01"]
["2019-03-01",3,"2019-03-01","2020-03-01","2021-03-01","2022-03-01","2023-03-01","2024-03-01"]
["2019-04-01",4,"2019-04-01","2020-04-01","2021-04-01","2022-04-01","2023-04-01","2024-04-01"]
["2019-05-01",5,"2019-05-01","2020-05-01","2021-05-01","2022-05-01","2023-05-01","2024-05-01"]
{"$rows_left_out":17}
{"sheet":"5.Dashboard","index":2,"n_rows":80,"n_cols":13,"rows_kept":80,"cut":false,"hidden":false,"merged":[[1,1,1,13],[5,2,5,3],[5,4,5,6],[5,8,5,9],[5,10,5,12],[79,9,79,11],[57,1,57,13],[64,1,64,13],[3,2,3,4],[66,9,66,11],[7,2,7,3],[7,4,7,6],[7,8,7,9],[7,10,7,12],[9,2,9,3],[9,4,9,6],[9,8,9,9],[9,10,9,12]]}
[]
[null,"BÁO CÁO BIẾN ĐỘNG NHÂN SỰ TOÀN CÔNG TY"]
[]
[null,null,"Chọn năm xem báo cáo",null,null,"Năm2020"]
[]
[null,null,{"$f":"'4.Report'!T10","v":0},null,{"$f":"\"Là số lượng nhân sự ĐẦU năm \" & RIGHT(F4,4)","v":"Là số lượng nhân sự ĐẦU năm 2020"},null,null,null,{"$f":"'4.Report'!W21","v":0},null,{"$f":"\"Là số lượng nhân sự CUỐI năm \" & RIGHT(F4,4)","v":"Là số lượng nhân sự CUỐI năm 2020"}]
{"$rows_left_out":75}
{"sheet":"DB_Data","index":3,"n_rows":44,"n_cols":18,"rows_kept":44,"cut":false,"hidden":true,"merged":[[36,0,36,1]]}
["Biến động nhân sự theo bộ phận"]
[null,"Chọn phòng",{"$f":"D2-1","v":-4},-3,-2,-1,0,1]
["STT","Nhóm",{"$f":"DATE(IF('5.Dashboard'!$M$67=\"Năm2019\",2019,IF('5.Dashboard'!$M$67=\"Năm2020\",2020)),C2,1)","v":"2019-08-01"},{"$f":"DATE(IF('5.Dashboard'!$M$67=\"Năm2019\",2019,IF('5.Dashboard'!$M$67=\"Năm2020\",2020)),D2,1)","v":"2019-09-01"},{"$f":"DATE(IF('5.Dashboard'!$M$67=\"Năm2019\",2019,IF('5.Dashboard'!$M$67=\"Năm2020\",2020)),E2,1)","v":"2019-10-01"},{"$f":"DATE(IF('5.Dashboard'!$M$67=\"Năm2019\",2019,IF('5.Dashboard'!$M$67=\"Năm2020\",2020)),F2,1)","v":"2019-11-01"},{"$f":"DATE(IF('5.Dashboard'!$M$67=\"Năm2019\",2019,IF('5.Dashboard'!$M$67=\"Năm2020\",2020)),G2,1)","v":"2019-12-01"},{"$f":"DATE(IF('5.Dashboard'!$M$67=\"Năm2019\",2019,IF('5.Dashboard'!$M$67=\"Năm2020\",2020)),H2,1)","v":"2020-01-01"}]
[1,"Trưởng phòng"]
[2,"Content"]
[3,"Ads"]
{"$rows_left_out":39}
{"sheet":"4.Report","index":4,"n_rows":24,"n_cols":47,"rows_kept":24,"cut":false,"hidden":false,"merged":[[14,11,14,12],[15,11,15,12],[16,11,16,12],[22,11,22,12],[23,11,23,12],[17,11,17,12],[18,11,18,12],[19,11,19,12],[20,11,20,12],[21,11,21,12],[9,11,9,12],[7,20,8,20],[7,21,8,21],[12,11,12,12],[13,11,13,12],[7,23,8,23],[7,24,8,24],[3,5,3,6],[3,9,3,10],[7,17,8,17],[7,18,8,18],[7,19,8,19],[7,11,8,12],[5,11,5,12],[20,26,20,27],[20,41,20,42],[7,1,8,1],[7,2,8,2],[7,3,8,3],[7,4,8,4],[7,5,8,5],[7,6,7,7],[7,8,8,8],[7,9,7,10],[7,13,8,13],[7,14,8,14],[7,15,8,15],[10,11,10,12],[11,11,11,12],[7,22,8,22]]}
[]
[null,"I. BÁO CÁO DANH SÁCH TĂNG GIẢM NHÂN SỰ THEO THÁNG",null,null,null,null,null,null,null,null,null,null,null,null,null,null,null,"II. BÁO CÁO TỶ LỆ NGHỈ VIỆC THEO GIAI ĐOẠN",null,null,null,null,null,null,null,null,"III. BÁO CÁO PHÂN TÍCH CƠ CẤU LAO ĐỘNG (Gồm cả những lao động đã làm việc/đã nghỉ việc trong tháng)"]
[]
[null,null,"Chọn năm","Năm2019",null,"Chọn ngày đầu kỳ",null,"2019-07-01",null,"Ngày cuối kỳ",null,{"$f":"EOMONTH(H4,0)","v":"2019-07-31"}]
[]
[null,"Điền","CT","CT","CT","CT","CT","CT","CT","CT","CT","CT",null,"CT","CT","CT"]
{"$rows_left_out":19}
{"sheet":"3.TTNV","index":5,"n_rows":18,"n_cols":59,"rows_kept":18,"cut":false,"hidden":false,"merged":[]}
["DANH SÁCH NHÂN VIÊN"]
["Mã NV hiện tại",null,{"$f":"MAX(INDIRECT($C$6))","v":170415}]
["Tình trạng nhân sự theo thời điểm",null,null,"Kỳ được chọn theo BC Nhân sự",{"$f":"VLOOKUP(D3,Define!G18:H21,2,0)","v":4}]
[]
["CT","CT","CT","CT","CT","CT","CT","CT","CT","CT","CT","CT","CT","CT","CT","CT","CT","CT","CT","CT","CT","CT","CT","CT","CT","CT","CT","CT","CT","CT","CT","CT","CT","CT","CT","CT","Điền","Điền","CT","CT","CT","CT","CT","CT","Chọn","Điền","CT","Điền","CT","CT","Điền","Điền","Điền","Điền","Điền","Điền","Điền","Điền","Điền"]
[null,null,{"$f":"ADDRESS(ROW($C$8),3,1,1) & \":\" & ADDRESS(MAX(A8:A999857)+7,3,1,1)","v":"$C$8:$C$18"},{"$f":"SUBTOTAL(3,D8:D32)","v":11},null,null,null,null,null,null,null,null,null,null,null,null,null,null,null,null,null,null,null,null,null,null,null,null,null,null,null,null,null,null,null,null,null,null,null,null,null,null,null,null,null,null,null,{"$f":"SUBTOTAL(9,AV8:AV14)","v":77000000},{"$f":"SUBTOTAL(9,AW8:AW14)","v":13200000},{"$f":"SUBTOTAL(9,AX8:AX14)","v":90200000}]
{"$rows_left_out":13}
{"sheet":"2. QT_LV","index":6,"n_rows":12,"n_cols":33,"rows_kept":12,"cut":false,"hidden":false,"merged":[[2,1,2,2],[2,5,2,7]]}
["THEO DÕI QUÁ TRÌNH LÀM VIỆC"]
[]
[null,"Check tổng",null,{"$f":"IF(AND(AC4=0,AD4=0,AE4=0,AF4=0),\"OK\",\"Lỗi\")","v":"Lỗi"},null,"Kỳ theo dõi: Từ ngày",null,null,{"$f":"'4.Report'!H4","v":"2019-07-01"},"Đến ngày",{"$f":"'4.Report'!L4","v":"2019-07-31"},null,null,null,null,null,null,null,null,null,null,null,null,null,null,null,null,null,"Nếu bằng 0 là OK","Nếu bằng 0 là OK","Nếu không có \"Nhập sai\" là OK","Nếu không có \"Nhập sai\" là OK"]
[null,null,null,null,null,null,null,null,null,null,null,null,null,null,null,null,null,null,null,null,null,null,null,null,null,null,null,null,{"$f":"COUNTIF(INDIRECT(AC6),\"False\")","v":4},{"$f":"COUNTIF(INDIRECT(AD6),\"False\")","v":0},0,0]
["CT","CT","Chọn","CT","CT","CT","CT","Điền","CT","CT","Điền","Điền","Điền","Điền","Điền","Điền","CT","CT","CT","Chọn","Chọn","CT","CT","CT","CT","CT","CT","CT","CT","CT","CT","CT","Điền"]
[{"$f":"ADDRESS(ROW($A$8),1,1,1,\"2. QT_LV\") & \":\" & ADDRESS(MAX('2. QT_LV'!A8:A999701)+6,1,1,1)","v":"'2. QT_LV'!$A$8:$A$11"},{"$f":"SUBSTITUTE($A$6,\"$A$\",\"$\"&LEFT(ADDRESS(1,COLUMN(),4,1),LEN(ADDRESS(1,COLUMN(),4,1))-1)&\"$\")","v":"'2. QT_LV'!$B$8:$B$11"},"'2. QT_LV'!$C$8:$C$11","'2. QT_LV'!$D$8:$D$11","'2. QT_LV'!$E$8:$E$11","'2. QT_LV'!$F$8:$F$11","'2. QT_LV'!$G$8:$G$11","'2. QT_LV'!$H$8:$H$11","'2. QT_LV'!$I$8:$I$11","'2. QT_LV'!$J$8:$J$11","'2. QT_LV'!$K$8:$K$11","'2. QT_LV'!$L$8:$L$11","'2. QT_LV'!$M$8:$M$11","'2. QT_LV'!$N$8:$N$11","'2. QT_LV'!$O$8:$O$11","'2. QT_LV'!$P$8:$P$11","'2. QT_LV'!$Q$8:$Q$11","'2. QT_LV'!$R$8:$R$11","'2. QT_LV'!$S$8:$S$11","'2. QT_LV'!$T$8:$T$11","'2. QT_LV'!$U$8:$U$11","'2. QT_LV'!$V$8:$V$11","'2. QT_LV'!$W$8:$W$11","'2. QT_LV'!$X$8:$X$11","'2. QT_LV'!$Y$8:$Y$11","'2. QT_LV'!$Z$8:$Z$11","'2. QT_LV'!$AA$8:$AA$11","'2. QT_LV'!$AB$8:$AB$11","'2. QT_LV'!$AC$8:$AC$11","'2. QT_LV'!$AD$8:$AD$11","'2. QT_LV'!$AE$8:$AE$11","'2. QT_LV'!$AF$8:$AF$11","'2. QT_LV'!$AG$8:$AG$11"]
{"$rows_left_out":7}
{"sheet":"1. QT_ĐV","index":7,"n_rows":39,"n_cols":24,"rows_kept":39,"cut":false,"hidden":false,"merged":[[2,1,2,2]]}
["THEO DÕI QUÁ TRÌNH ĐƠN VỊ",null,null,null,null,null,null,null,"Bằng 0 là đúng"]
[]
[null,"Kỳ theo dõi: Từ ngày",null,{"$f":"'4.Report'!H4","v":"2019-07-01"},"Đến ngày",{"$f":"'4.Report'!L4","v":"2019-07-31"},null,null,{"$f":"COUNTIF(I9:I46,\"False\")","v":1}]
[]
["CT","CT","CT","Điền","Điền","Điền","Điền","Điền","CT","CT","CT","Điền","CT","CT","CT","CT","CT","CT","CT","CT","CT","CT","CT","CT"]
[{"$f":"ADDRESS(ROW($A$9),1,1,1,\"1. QT_ĐV\") & \":\" & ADDRESS(MAX('1. QT_ĐV'!A9:A46)+6,1,1,1)","v":"'1. QT_ĐV'!$A$9:$A$37"},{"$f":"SUBSTITUTE($A$6,\"$A$\",\"$\"&LEFT(ADDRESS(1,COLUMN(),4,1),LEN(ADDRESS(1,COLUMN(),4,1))-1)&\"$\")","v":"'1. QT_ĐV'!$B$9:$B$37"},{"$f":"SUBSTITUTE($A$6,\"$A$\",\"$\"&LEFT(ADDRESS(1,COLUMN(),4,1),LEN(ADDRESS(1,COLUMN(),4,1))-1)&\"$\")","v":"'1. QT_ĐV'!$C$9:$C$37"},"'1. QT_ĐV'!$D$9:$D$37","'1. QT_ĐV'!$E$9:$E$37","'1. QT_ĐV'!$F$9:$F$37","'1. QT_ĐV'!$G$9:$G$37","'1. QT_ĐV'!$H$9:$H$37","'1. QT_ĐV'!$I$9:$I$37","'1. QT_ĐV'!$J$9:$J$37","'1. QT_ĐV'!$K$9:$K$37","'1. QT_ĐV'!$L$9:$L$37","'1. QT_ĐV'!$M$9:$M$37","'1. QT_ĐV'!$N$9:$N$37","'1. QT_ĐV'!$O$9:$O$37","'1. QT_ĐV'!$P$9:$P$37","'1. QT_ĐV'!$Q$9:$Q$37",{"$f":"SUBSTITUTE($A$6,\"$A$\",\"$\"&LEFT(ADDRESS(1,COLUMN(),4,1),LEN(ADDRESS(1,COLUMN(),4,1))-1)&\"$\")","v":"'1. QT_ĐV'!$R$9:$R$37"},"'1. QT_ĐV'!$S$9:$S$37","'1. QT_ĐV'!$T$9:$T$37","'1. QT_ĐV'!$U$9:$U$37","'1. QT_ĐV'!$V$9:$V$37","'1. QT_ĐV'!$W$9:$W$37","'1. QT_ĐV'!$X$9:$X$37"]
{"$rows_left_out":34}
{"sheet":"DSNV_Import","index":8,"n_rows":4,"n_cols":30,"rows_kept":4,"cut":false,"hidden":false,"merged":[]}
[]
[]
["MSNV","Họ và tên","Giới tính","Ngày sinh","Nơi sinh","Địa chỉ thường trú","Địa chỉ hiện tại","Số điện thoại","E-mail","Tình trạng hôn nhân","Vợ/chồng","Năm sinh vợ/chồng","Con thứ 1","Năm sinh con thứ 1","Con thứ 2","Năm sinh con thứ 2","Con thứ 3","Năm sinh con thứ 3","Số CMND","Ngày cấp","Nơi cấp","Mã số thuế TNCN","Số người phụ thuộc","Trình độ","Chuyên ngành","Trường","Loại thanh toán lương","Họ tên chuyển khoản","Số tài khoản","Ngân hàng"]
[170415,"Đàm Anh Tú","Nam","1991-06-07","Hà Nội","Số 123, Ðường ABC, Phường Tân Mai, Quận Hoàng Mai, Tp Hà Nội","Số 123, Ðường ABC, Phường Tân Mai, Quận Hoàng Mai, Tp Hà Nội","0934.123.321","nguyenvana@gmail.com","Độc thân",null,null,null,null,null,null,null,null,123456789,"2010-12-21","Hà Nội","123345456767",3,"Đại học","Kinh tế lao động","NEU","Tiền Mặt"]